(E)-β-Famesene

Kovats' RI, non-polar column, custom temperature program

Data compiled by: NIST Mass Spectrometry Data Center, William E. Wallace, director

Column type CapillaryCapillaryCapillaryCapillaryCapillary
Active phase BP-1BP-1OV-1BP-1DB-5
Column length (m) 30.25.15.30.30.
Carrier gas N2N2HeN2
Substrate
Column diameter (mm) 0.320.250.3170.320.26
Phase thickness (μm) 0.250.250.250.250.25
Program 60C => 5C/min => 220C (5min) => 3C/min => 245C(5min)60C => 5C/min => 220C (5min) => 3C/min => 245 C (5min)50C(4min) => (4C/min) => 90C => (10C/min)=300C(10min)60 C 5 C/min -> 220 C (5 min) 3 C/min -> 245 C (5 min)not specified
I 1454.1466.1448.1466.1458.
ReferenceKhan, Verma, et al., 2006Khan, Srivastava, et al., 2003El-Shazly, Dorai, et al., 2002Khan, Srivastava, et al., 2002Adams, 1998
Comment MSDC-RI MSDC-RI MSDC-RI MSDC-RI MSDC-RI
Column type CapillaryCapillary
Active phase Methyl SiliconeSF-96
Column length (m) 25.150.
Carrier gas
Substrate
Column diameter (mm)  0.75
Phase thickness (μm)
Program 50 0C 4 0C/min -> 180 0C 10 0C/min -> 250 0Cnot specified
I 1442.1426.
ReferenceMachado, Militao, et al., 1995Malingré and Maarse, 1974
Comment MSDC-RI MSDC-RI

Phase change data

Data compiled by: William E. Acree, Jr., James S. Chickos

Quantity Value Units Method Reference Comment
Δvap72.5kJ/molGCHoskovec, Grygarová, et al., 2005Based on data from 363. - 473. K.

Kovats' RI, non-polar column, isothermal

View large format table.

Column type Active phase Temperature (C) I Reference Comment
CapillaryZB-1100.1442.98Hoskovec, Grygarová, et al., 200530. m/0.32 mm/0.25 μm, He
CapillaryZB-1110.1444.19Hoskovec, Grygarová, et al., 200530. m/0.32 mm/0.25 μm, He
CapillaryZB-1120.1445.07Hoskovec, Grygarová, et al., 200530. m/0.32 mm/0.25 μm, He
CapillaryZB-1130.1446.33Hoskovec, Grygarová, et al., 200530. m/0.32 mm/0.25 μm, He
CapillaryZB-1140.1447.6Hoskovec, Grygarová, et al., 200530. m/0.32 mm/0.25 μm, He
CapillaryZB-1150.1448.81Hoskovec, Grygarová, et al., 200530. m/0.32 mm/0.25 μm, He
CapillaryZB-1160.1450.11Hoskovec, Grygarová, et al., 200530. m/0.32 mm/0.25 μm, He
CapillaryZB-1170.1451.4Hoskovec, Grygarová, et al., 200530. m/0.32 mm/0.25 μm, He
CapillaryZB-1180.1452.77Hoskovec, Grygarová, et al., 200530. m/0.32 mm/0.25 μm, He
CapillaryZB-1190.1454.09Hoskovec, Grygarová, et al., 200530. m/0.32 mm/0.25 μm, He
CapillaryZB-1200.1455.44Hoskovec, Grygarová, et al., 200530. m/0.32 mm/0.25 μm, He
CapillaryZB-190.1441.8Hoskovec, Grygarová, et al., 200530. m/0.32 mm/0.25 μm, He
CapillaryEC-1130.1446.Szafranek, Chrapkowska, et al., 200530. m/0.25 mm/0.25 μm
CapillaryEC-1150.1449.Szafranek, Chrapkowska, et al., 200530. m/0.25 mm/0.25 μm
CapillaryDB-1150.1449.Viswanathan, Maridass, et al., 200228. m/0.25 mm/0.25 μm, He

Kovats' RI, non-polar column, temperature ramp

View large format table.

Column type Active phase I Reference Comment
CapillaryDB-5MS1429.Marongiu, Porcedda, et al., 200630. m/0.25 mm/0.25 μm, He, 3. K/min, 280. C @ 30. min; Tstart: 60. C
CapillaryHP-51459.Oliveira, Leitao, et al., 200625. m/0.2 mm/0.33 μm, 3. K/min; Tstart: 60. C; Tend: 240. C
CapillaryHP-5MS1459.Asuming, Beauchamp, et al., 200530. m/0.25 mm/0.25 μm, He, 50. C @ 10. min, 3. K/min, 250. C @ 5. min
CapillaryDB-51458.Medina, Lucero, et al., 200530. m/0.25 mm/0.25 μm, Helium, 3. K/min; Tstart: 60. C; Tend: 255. C
CapillarySPB-11445.Behera, Nagarajan, et al., 200430. m/0.32 mm/0.25 μm, He, 50. C @ 2. min, 2. K/min, 250. C @ 5. min
CapillaryHP-5MS1455.Juliani, Zygadlo, et al., 200430. m/0.25 mm/0.25 μm, He, 60. C @ 1. min, 4. K/min, 200. C @ 15. min
CapillaryHP-51459.Lopes, Strobl, et al., 200430. m/0.25 mm/0.25 μm, He, 3. K/min; Tstart: 60. C; Tend: 260. C
CapillaryDB-51460.Merle, Morón, et al., 200425. m/0.25 mm/0.25 μm, He, 60. C @ 6. min, 5. K/min, 180. C @ 15. min
CapillaryCP Sil 5 CB1450.Ogunwande, Olawore, et al., 200425. m/0.25 mm/0.15 μm, H2, 3. K/min; Tstart: 50. C; Tend: 230. C
CapillaryCP Sil 8 CB1453.Schwob, Bessiere, et al., 200430. m/0.25 mm/0.25 μm, H2, 50. C @ 2. min, 3. K/min; Tend: 220. C
CapillaryDB-51471.Baranauskiene, Venskutonis, et al., 200350. m/0.32 mm/0.25 μm, He, 50. C @ 2. min, 5. K/min, 280. C @ 10. min
CapillaryHP-5MS1439.Gkinis, Tzakou, et al., 200330. m/0.25 mm/0.25 μm, He, 3. K/min; Tstart: 60. C; Tend: 280. C
CapillaryDB-51459.Viña and Murillo, 200330. m/0.25 mm/0.25 μm, He, 50. C @ 5. min, 0.5 K/min, 250. C @ 10. min
CapillaryDB-11458.Mevy, Bessiere, et al., 2002He, 3. K/min; Column length: 25. m; Column diameter: 0.2 mm; Tstart: 60. C; Tend: 220. C
CapillarySE-301473.Palá-Paúl, Velasco-Negueruela, et al., 200225. m/0.22 mm/0.25 μm, He, 4. K/min; Tstart: 70. C; Tend: 220. C
CapillaryBP-11466.Raina, Srivastava, et al., 200225. m/0.32 mm/0.25 μm, N2, 5. K/min, 220. C @ 15. min; Tstart: 60. C
CapillaryBP-11448.Raina, Srivastava, et al., 2002, 225. m/0.55 mm/0.25 μm, N2, 5. K/min, 220. C @ 15. min; Tstart: 60. C
CapillaryBP-11461.Jain, Aggarwal, et al., 200125. m/0.55 mm/0.25 μm, N2, 5. K/min, 220. C @ 15. min; Tstart: 60. C
CapillaryDB-11446.Palá-Paúl, Velasco-Negueruela, et al., 200150. m/0.25 mm/0.25 μm, N2, 4. K/min; Tstart: 80. C; Tend: 225. C
CapillaryBP-11451.Raina, Srivastava, et al., 200125. m/0.55 mm/0.25 μm, N2, 5. K/min, 220. C @ 15. min; Tstart: 60. C
CapillaryHP-51456.Tzakou and Couladis, 200130. m/0.25 mm/0.25 μm, He, 3. K/min; Tstart: 60. C; Tend: 280. C
CapillaryDB-51458.Adams, 200030. m/0.26 mm/0.25 μm, He, 3. K/min; Tstart: 60. C; Tend: 240. C
CapillaryHP-5MS1458.Roussis, Tsoukatou, et al., 200030. m/0.25 mm/0.25 μm, He, 3. K/min; Tstart: 60. C; Tend: 280. C
CapillaryBP-51458.Weissbecker B., Van Loon J.J.A., et al., 200025. m/0.25 mm/0.25 μm, He, 3. K/min; Tstart: 60. C; Tend: 200. C
CapillaryDB-51458.Adams, 199930. m/0.26 mm/0.25 μm, He, 3. K/min; Tstart: 60. C; Tend: 246. C
CapillaryOV-1011448.Kuiate, Zollo, et al., 19995. K/min; Column length: 25. m; Column diameter: 0.32 mm; Tstart: 50. C; Tend: 200. C
CapillaryDB-51458.da Silva, Andrade, et al., 199930. m/0.25 mm/0.25 μm, He, 3. K/min; Tstart: 60. C; Tend: 240. C
CapillaryDB-51457.da Silva, Zoghbi, et al., 199930. m/0.25 mm/0.25 μm, He, 4. K/min; Tstart: 60. C; Tend: 240. C
CapillaryMethyl Silicone1460.Mallavarapu, Rao, et al., 1998N2, 5. K/min; Column length: 25. m; Column diameter: 0.5 mm; Tstart: 60. C; Tend: 220. C
CapillaryCP Sil 5 CB1446.Szafranek, Malinski, et al., 199830. m/0.25 mm/0.25 μm, Ar, 3. K/min; Tstart: 60. C; Tend: 220. C
CapillaryCP Sil 8 CB1457.Szafranek, Malinski, et al., 199825. m/0.15 mm/0.12 μm, Ar, 3. K/min; Tstart: 60. C; Tend: 220. C
CapillarySE-301478.Jantan, Ahmad, et al., 1996N2, 60. C @ 10. min, 3. K/min, 180. C @ 1. min; Column length: 25. m; Column diameter: 0.2 mm
CapillaryDB-11458.Saad, El-Sharkawy, et al., 199528. m/0.25 mm/0.25 μm, He, 50. C @ 1. min, 4. K/min; Tend: 270. C
CapillaryBP-11455.Ekundayo, Laakso, et al., 1988H2, 65. C @ 2. min, 5. K/min; Column length: 50. m; Column diameter: 0.33 mm; Tend: 220. C

Kovats' RI, polar column, isothermal

View large format table.

Column type Active phase Temperature (C) I Reference Comment
CapillaryCarbowax 20M130.1671.Malingré and Maarse, 1974Column length: 150. m; Column diameter: 0.75 mm

Kovats' RI, polar column, temperature ramp

View large format table.

Column type Active phase I Reference Comment
CapillaryDB-Wax1662.Lopes, Strobl, et al., 200430. m/0.32 mm/0.25 μm, He, 40. C @ 5. min, 3. K/min; Tend: 220. C
CapillaryDB-Wax1622.Nébié, Yaméogo, et al., 200430. m/0.25 mm/0.25 μm, 2. K/min, 240. C @ 40. min; Tstart: 40. C
CapillaryInnowax1650.Viña and Murillo, 200330. m/0.25 mm/0.25 μm, He, 50. C @ 5. min, 0.5 K/min, 250. C @ 10. min
CapillarySupelcowax-101667.Tzakou and Couladis, 200130. m/0.32 mm/0.25 μm, He, 3. K/min; Tstart: 75. C; Tend: 230. C
CapillaryCarbowax 20M1688.Mallavarapu, Rao, et al., 1998N2, 5. K/min; Column length: 25. m; Column diameter: 0.5 mm; Tstart: 60. C; Tend: 200. C
CapillaryCarbowax1664.Szafranek, Malinski, et al., 199830. m/0.25 mm/0.25 μm, Ar, 4. K/min; Tstart: 50. C; Tend: 220. C
CapillaryDB-Wax1665.Umano, Hagi, et al., 1994He, 40. C @ 2. min, 2. K/min; Column length: 60. m; Column diameter: 0.25 mm; Tend: 200. C

Van Den Dool and Kratz RI, non-polar column, temperature ramp

View large format table.

Column type Active phase I Reference Comment
CapillaryBP-11448.Boti, Koukoua, et al., 200750. m/0.22 mm/0.25 μm, He, 2. K/min, 220. C @ 20. min; Tstart: 60. C
CapillaryBP-11448.Duquesnoy, Castola, et al., 200750. m/0.22 mm/0.25 μm, He, 2. K/min, 220. C @ 20. min; Tstart: 60. C
CapillaryDB-51459.Flamini, Cioni, et al., 200730. m/0.25 mm/0.25 μm, He, 3. K/min; Tstart: 60. C; Tend: 240. C
CapillaryHP-51458.Flamini, Tebano, et al., 200730. m/0.25 mm/0.25 μm, N2, 50. C @ 10. min, 5. K/min; Tend: 220. C
CapillaryHP-5MS1459.Kundakovic, Fokialakis, et al., 200730. m/0.25 mm/0.25 μm, He, 3. K/min; Tstart: 60. C; Tend: 280. C
CapillaryRTX-11452.Paolini J., Costa J., et al., 200760. m/0.22 mm/0.25 μm, He, 2. K/min, 230. C @ 35. min; Tstart: 60. C
CapillaryRTX-11450.Paolini, Muselli, et al., 200760. m/0.22 mm/0.25 μm, He, 2. K/min, 230. C @ 35. min; Tstart: 60. C
CapillarySPB-11449.Radulovic, Lazarevic, et al., 200730. m/0.25 mm/0.25 μm, He, 50. C @ 3. min, 5. K/min, 250. C @ 15. min
CapillaryHP-5MS1457.Radulovic, Lazarevic, et al., 200730. m/0.25 mm/0.25 μm, He, 60. C @ 5. min, 4. K/min; Tend: 280. C
CapillaryDB-51457.Rout, Rao, et al., 200725. m/0.25 mm/0.25 μm, He, 2. K/min, 200. C @ 60. min; Tstart: 60. C
CapillaryDB-51461.Sabulal, Dan, et al., 200730. m/0.25 mm/0.25 μm, He, 5. K/min; Tstart: 60. C; Tend: 260. C
CapillaryHP-5MS1454.Saroglou, Arfan, et al., 200730. m/0.25 mm/0.25 μm, He, 60. C @ 5. min, 4. K/min; Tend: 280. C
CapillaryDB-51457.Silva, Barbosa, et al., 200730. m/0.22 mm/0.25 μm, He, 55. C @ 2. min, 3. K/min, 240. C @ 15. min
CapillaryDB-11453.Sonboli, Azizian, et al., 200760. m/0.25 mm/0.25 μm, N2, 5. K/min, 250. C @ 10. min; Tstart: 60. C
CapillaryBP-11448.Boti, Bighelli, et al., 200650. m/0.22 mm/0.25 μm, He, 2. K/min, 220. C @ 20. min; Tstart: 60. C
CapillaryRTX-11447.Cavalli, Tomi, et al., 200660. m/0.22 mm/0.25 μm, He, 2. K/min, 230. C @ 45. min; Tstart: 60. C
CapillaryHP-51456.Flamini, Tebano, et al., 200630. m/0.25 mm/0.25 μm, N2, 60. C @ 10. min, 5. K/min; Tend: 220. C
CapillaryBP-11446.Gonny, Cavaleiro, et al., 200650. m/0.22 mm/0.25 μm, He, 2. K/min, 220. C @ 20. min; Tstart: 60. C
CapillaryHP-5MS1455.Kukic J., Petrovic S., et al., 200630. m/0.25 mm/0.25 μm, He, 3. K/min; Tstart: 60. C; Tend: 280. C
CapillaryDB-51458.Masoudi, Esmaeili, et al., 200650. m/0.2 mm/0.32 μm, N2, 60. C @ 3. min, 5. K/min, 220. C @ 5. min
CapillaryDB-51450.Pavlovic, Tzakou, et al., 200630. m/0.32 mm/0.25 μm, He, 3. K/min; Tstart: 60. C; Tend: 280. C
CapillarySPB-11447.Pinto, Pina-Vaz, et al., 200630. m/0.2 mm/0.2 μm, He, 3. K/min, 220. C @ 15. min; Tstart: 70. C
CapillaryOV-11459.Rubiolo P., Matteodo M., et al., 200625. m/0.25 mm/0.25 μm, He, 50. C @ 1. min, 3. K/min, 220. C @ 5. min
CapillaryHP-5MS1453.Saroglou, Dorizas, et al., 200630. m/0.25 mm/0.25 μm, He, 60. C @ 5. min, 4. K/min; Tend: 280. C
CapillaryHP-5MS1457.Silva-Brandão, Solferini, et al., 200630. m/0.25 mm/0.25 μm, He, 3. K/min; Tstart: 60. C; Tend: 300. C
CapillaryHP-51458.Vundac, Pfeifhofer, et al., 200630. m/0.25 mm/0.25 μm, He, 40. C @ 5. min, 4. K/min; Tend: 300. C
CapillaryCP Sil 5 CB1446.Ziegenbein, Hanssen, et al., 2006H2, 10. K/min; Column length: 25. m; Column diameter: 0.25 mm; Tstart: 80. C; Tend: 270. C
CapillaryCP Sil 5 CB1446.Ziegenbein, Hanssen, et al., 2006, 225. m/0.25 mm/0.4 μm, He, 10. K/min; Tstart: 80. C; Tend: 270. C
CapillaryDB-11445.Agnaniet, Makani, et al., 200530. m/0.25 mm/0.25 μm, N2, 5. K/min; Tstart: 50. C; Tend: 200. C
CapillaryBP-11450.Boti J.B., Koukoua G., et al., 200550. m/0.22 mm/0.25 μm, He, 2. K/min, 220. C @ 20. min; Tstart: 60. C
CapillarySE-541451.Brantner, Pfeifhofer, et al., 200550. m/0.25 mm/0.27 μm, H2, 5. K/min; Tstart: 50. C; Tend: 300. C
CapillaryHP-51457.Celik, Gokturk, et al., 200530. m/0.25 mm/0.25 μm, N2, 60. C @ 10. min, 5. K/min; Tend: 220. C
CapillaryDB-11449.Dob, Berramdane, et al., 200530. m/0.32 mm/0.25 μm, N2, 50. C @ 3. min, 2. K/min, 260. C @ 5. min
CapillaryDB-11443.Fanciullino, Gancel, et al., 200530. m/0.25 mm/0.25 μm, He, 3. K/min, 250. C @ 20. min; Tstart: 40. C
CapillaryBP-11450.Ferrari, Tomi, et al., 200550. m/0.22 mm/0.25 μm, He, 2. K/min, 220. C @ 20. min; Tstart: 60. C
CapillaryHP-51460.Flamini, Luigi Cioni, et al., 200530. m/0.25 mm/0.25 μm, N2, 60. C @ 10. min, 5. K/min; Tend: 220. C
CapillaryHP-51458.Flamini, Luigi Cioni, et al., 2005, 230. m/0.25 mm/0.25 μm, N2, 60. C @ 10. min, 5. K/min; Tend: 220. C
CapillaryDB-11438.Gancel, Ollitrault, et al., 200530. m/0.25 mm/0.25 μm, He, 3. K/min, 250. C @ 20. min; Tstart: 40. C
CapillaryDB-11456.bin Jantan, Yalvema, et al., 200525. m/0.25 mm/0.25 μm, 60. C @ 10. min, 3. K/min, 180. C @ 10. min
CapillaryDB-51458.bin Jantan, Yalvema, et al., 2005, 225. m/0.25 mm/0.25 μm, N2, 75. C @ 10. min, 3. K/min, 210. C @ 1. min
CapillaryHP-51455.Javidnia, Miri, et al., 200530. m/0.25 mm/0.25 μm, He, 3. K/min; Tstart: 60. C; Tend: 260. C
CapillaryDB-5MS1456.Seo and Baek, 200560. m/0.25 mm/0.25 μm, He, 2. K/min, 200. C @ 20. min; Tstart: 40. C
CapillarySE-541457.Simionatto, Porto, et al., 200525. m/0.25 mm/0.2 μm, H2, 4. K/min; Tstart: 50. C; Tend: 250. C
CapillaryDB-11445.Tchoumbougnang, Zollo, et al., 200530. m/0.25 mm/0.25 μm, N2, 5. K/min; Tstart: 50. C; Tend: 200. C
CapillaryMega 5MS1452.Verzera, Trozzi, et al., 200530. m/0.25 mm/0.25 μm, He, 40. C @ 2. min, 3. K/min; Tend: 240. C
CapillaryHP-5MS1454.Aligiannis, Kalpoutzakis, et al., 200430. m/0.25 mm/0.25 μm, He, 3. K/min; Tstart: 60. C; Tend: 280. C
CapillarySPB-11446.Antunes, Sevinate-Pinto, et al., 200430. m/0.25 mm/0.25 μm, He, 3. K/min, 220. C @ 15. min; Tstart: 70. C
CapillarySPB-11444.Cavaleiro, Salgueiro, et al., 200430. m/0.2 mm/0.2 μm, He, 3. K/min, 220. C @ 15. min; Tstart: 70. C
CapillaryHP-5MS1456.Chorianopoulos, Kalpoutzakis, et al., 200430. m/0.25 mm/0.25 μm, He, 3. K/min; Tstart: 60. C; Tend: 280. C
CapillaryHP-51459.Flamini, Bader, et al., 200430. m/0.25 mm/0.25 μm, He, 3. K/min; Tstart: 60. C; Tend: 240. C
CapillaryHP-51459.Flamini, Luigi Cioni, et al., 200430. m/0.25 mm/0.25 μm, N2, 60. C @ 10. min, 5. K/min; Tend: 220. C
CapillaryBP-11446.Gonny, Bradesi, et al., 200450. m/0.22 mm/0.25 μm, 2. K/min, 220. C @ 20. min; Tstart: 60. C
CapillaryHP-5MS1457.Grujic-Jovanovic, Skaltsa, et al., 200430. m/0.25 mm/0.25 μm, He, 60. C @ 5. min, 4. K/min; Tend: 280. C
CapillaryHP-51458.Javidnia, Miri, et al., 2004He, 3. K/min; Column length: 30. m; Column diameter: 0.25 mm; Tstart: 60. C; Tend: 260. C
CapillarySPB-11447.Moldão-Martins, Beirão-da-Costa, et al., 200430. m/0.2 mm/0.2 μm, He, 3. K/min, 220. C @ 15. min; Tstart: 70. C
CapillaryHP-5MS1457.Mumm, Tiemann, et al., 200430. m/0.25 mm/0.25 μm, He, 50. C @ 5. min, 5. K/min; Tend: 300. C
CapillaryRSL-2001467.Ngassoum, Ousmaila, et al., 200430. m/0.32 mm/0.25 μm, H2, 40. C @ 5. min, 6. K/min, 280. C @ 5. min
CapillaryHP-5MS1437.Tzakou, Vagias, et al., 200430. m/0.25 mm/0.25 μm, He, 3. K/min; Tstart: 60. C; Tend: 280. C
CapillaryDB-5MS1456.Yu, Kim, et al., 200430. m/0.25 mm/0.25 μm, He, 40. C @ 5. min, 4. K/min, 200. C @ 20. min
CapillaryDB-5MS1454.Zheng, Kim, et al., 200430. m/0.25 mm/0.25 μm, He, 40. C @ 5. min, 4. K/min, 200. C @ 20. min
CapillaryDB-51458.bin Ahmad and bin Jantan, 200325. m/0.25 mm/0.25 μm, N2, 75. C @ 10. min, 3. K/min, 210. C @ 1. min
CapillaryBPX-51459.bin Ahmad and bin Jantan, 2003, 230. m/0.25 mm/0.25 μm, N2, 75. C @ 10. min, 3. K/min, 210. C @ 1. min
CapillaryHP-51459.Angelini, Carpanese, et al., 200330. m/0.25 mm/0.25 μm, N2, 60. C @ 10. min, 5. K/min; Tend: 220. C
CapillaryDB-51459.Bader, Caponi, et al., 200330. m/0.25 mm/0.25 μm, N2, 60. C @ 10. min, 5. K/min; Tend: 220. C
CapillarySPB-11447.Cavaleiro, Salgueiro, et al., 200330. m/0.2 mm/0.2 μm, He, 3. K/min, 220. C @ 15. min; Tstart: 70. C
CapillaryRTX-11447.Cavalli, Tomi, et al., 200360. m/0.22 mm/0.25 μm, He, 2. K/min, 230. C @ 45. min; Tstart: 60. C
CapillaryUltra-21455.Ceva-Antunes, Bizzo, et al., 200325. m/0.25 mm/0.33 μm, H2, 40. C @ 2. min, 3. K/min, 280. C @ 10. min
CapillaryOptima 51471.Chosson, Vérité, et al., 200325. m/0.25 mm/0.25 μm, He, 3. K/min, 280. C @ 20. min; Tstart: 60. C
CapillaryHP-51455.Dural, Bagci, et al., 200330. m/0.25 mm/0.25 μm, N2, 60. C @ 10. min, 5. K/min; Tend: 220. C
CapillaryHP-51460.Ertugrul, Dural, et al., 200330. m/0.25 mm/0.25 μm, N2, 60. C @ 10. min, 5. K/min; Tend: 220. C
CapillaryHP-51459.Flamini, Luigi Cioni, et al., 200330. m/0.25 mm/0.25 μm, N2, 60. C @ 10. min, 5. K/min; Tend: 220. C
CapillaryHP-51459.Flamini, Luigi Cioni, et al., 2003, 230. m/0.25 mm/0.25 μm, N2, 60. C @ 10. min, 5. K/min; Tend: 220. C
CapillaryDB-11438.Gancel, Ollitrault, et al., 200330. m/0.25 mm/0.25 μm, He, 3. K/min, 250. C @ 20. min; Tstart: 40. C
CapillaryPE-51457.Isidorov and Vinogorova, 2003He, 3. K/min; Column length: 30. m; Column diameter: 0.25 mm; Tstart: 40. C; Tend: 280. C
CapillaryDB-51459.Javidnia, Miri, et al., 2003He, 4. K/min; Column length: 25. m; Column diameter: 0.25 mm; Tstart: 60. C; Tend: 260. C
CapillaryHP-51458.Macchioni, Cioni, et al., 200330. m/0.25 mm/0.25 μm, He, 3. K/min; Tstart: 60. C; Tend: 240. C
CapillaryBPX-51455.Shellie, Marriott, et al., 200330. m/0.25 mm/0.25 μm, He, 60. C @ 2. min, 3. K/min; Tend: 240. C
CapillaryHP-51457.Skaltsa, Demetzos, et al., 200330. m/0.25 mm/0.25 μm, He, 60. C @ 5. min, 4. K/min; Tend: 280. C
CapillarySPB-11447.Cavaleiro, Salgueiro, et al., 200230. m/0.20 mm/0.20 μm, He, 3. K/min, 220. C @ 15. min; Tstart: 70. C
CapillaryDB-51452.Choi, Kim. M.-S.L., et al., 200230. m/0.25 mm/0.25 μm, He, 70. C @ 2. min, 4. K/min, 230. C @ 20. min
CapillaryDB-51460.Flamini, Cioni, et al., 200230. m/0.25 mm/0.25 μm, He, 3. K/min; Tstart: 60. C; Tend: 240. C
CapillaryCP Sil 5 CB1458.Heinrich, Pfeifhofer, et al., 200250. m/0.25 mm/0.15 μm, H2, 40. C @ 3. min, 4. K/min; Tend: 300. C
CapillaryDB-11445.bin Jantan and bin Ahmad, 2002N2, 60. C @ 10. min, 3. K/min, 180. C @ 10. min; Column length: 25. m; Column diameter: 0.25 mm
CapillaryBP-11448.Lota, de Rocca Serra, et al., 200250. m/0.22 mm/0.25 μm, He, 2. K/min, 220. C @ 20. min; Tstart: 60. C
CapillaryHP-11447.Nath, Sarma, et al., 200224. m/0.32 mm/0.17 μm, He, 60. C @ 2. min, 4. K/min, 250. C @ 20. min
CapillaryRTX-51458.Shellie, Mondello, et al., 200230. m/0.25 mm/0.25 μm, He, 45. C @ 6. min, 3. K/min; Tend: 250. C
CapillaryRTX-51461.Shellie, Mondello, et al., 200230. m/0.25 mm/0.25 μm, He, 45. C @ 6. min, 3. K/min; Tend: 250. C
CapillaryHP-51456.Aligiannis, Kalpoutzakis, et al., 200130. m/0.25 mm/0.25 μm, He, 60. C @ 5. min, 3. K/min; Tend: 280. C
CapillaryBP-11447.Bianchini, Tomi, et al., 200150. m/0.22 mm/0.25 μm, He, 2. K/min, 230. C @ 35. min; Tstart: 60. C
CapillaryDB-51459.Bortolomeazzi, Berno, et al., 200130. m/0.25 mm/0.25 μm, He, 60. C @ 3. min, 5. K/min; Tend: 300. C
CapillaryHP-51450.Couladis, Tsortanidou, et al., 200130. m/0.25 mm/0.25 μm, He, 3. K/min; Tstart: 60. C; Tend: 380. C
CapillaryHP-11448.Guilliard, Delgado, et al., 200160. m/0.25 mm/0.25 μm, He, 50. C @ 5. min, 2.5 K/min; Tend: 250. C
CapillaryHP-51458.Guilliard, Delgado, et al., 200150. m/0.25 mm/0.25 μm, He, 50. C @ 5. min, 2.5 K/min; Tend: 250. C
CapillaryDB-51456.Nogueira, Bittrich, et al., 200130. m/0.25 mm/0.25 μm, H2, 3. K/min; Tstart: 60. C; Tend: 240. C
CapillaryHP-5MS1457.Skaltsa, Mavrommati, et al., 200130. m/0.25 mm/0.25 μm, He, 60. C @ 5. min, 4. K/min; Tend: 280. C
CapillaryDB-51447.Bartley and Jacobs, 200060. m/0.25 mm/0.25 μm, He, 40. C @ 2. min, 4. K/min, 290. C @ 5. min
CapillaryDB-51459.Bortolomeazzi, Pizzale, et al., 200030. m/0.25 mm/0.25 μm, He, 60. C @ 3. min, 5. K/min; Tend: 300. C
CapillaryHP-51459.Lazari, Skaltsa, et al., 200030. m/0.25 mm/0.25 μm, He, 50. C @ 5. min, 4. K/min; Tend: 280. C
CapillaryHP-51453.Lazari, Skaltsa, et al., 2000, 230. m/0.25 mm/0.25 μm, He, 50. C @ 5. min, 4. K/min; Tend: 280. C
CapillaryBP-11448.Lota, de Rocca Serra, et al., 200050. m/0.22 mm/0.25 μm, He, 2. K/min, 230. C @ 35. min; Tstart: 60. C
CapillaryRTX-51461.Mondello, Zappia, et al., 200010. m/0.1 mm/0.1 μm, He, 12.3 K/min; Tstart: 50. C; Tend: 350. C
CapillaryHP-51456.Song, Sawamura, et al., 200030. m/0.25 mm/0.25 μm, He, 2. K/min; Tstart: 70. C; Tend: 230. C
CapillaryDB-51456.Song, Sawamura, et al., 2000, 230. m/0.25 mm/0.25 μm, N2, 2. K/min; Tstart: 70. C; Tend: 230. C
CapillaryMega 5MS1452.Verzera, Trozzi, et al., 200030. m/0.25 mm/0.25 μm, He, 40. C @ 2. min, 3. K/min; Tend: 240. C
CapillaryDB-11448.Javidnia and Shafiee, 1999He, 3. K/min, 230. C @ 5. min; Column length: 60. m; Column diameter: 0.32 mm; Tstart: 60. C
CapillaryHP-51456.Lazari, Skaltsa, et al., 199930. m/0.25 mm/0.25 μm, He, 50. C @ 5. min, 4. K/min; Tend: 280. C
CapillaryBP-11448.Lota, Serra, et al., 199950. m/0.22 mm/0.25 μm, He, 2. K/min, 230. C @ 35. min; Tstart: 60. C
CapillaryBP-11448.Lota, Serra, et al., 199950. m/0.22 mm/0.25 μm, He, 2. K/min, 230. C @ 35. min; Tstart: 60. C
CapillaryBP-11448.Mazzoni, Tomi, et al., 199950. m/0.22 mm/0.25 μm, He, 2. K/min, 220. C @ 20. min; Tstart: 60. C
CapillaryMethyl Silicone1459.Sumathykutty, Rao, et al., 199950. m/0.25 mm/0.17 μm, N2, 2. K/min; Tstart: 80. C; Tend: 200. C
CapillaryOV-11433.Bicchi, Rubiolo, et al., 199825. m/0.25 mm/0.3 μm, 50. C @ 1. min, 3. K/min, 200. C @ 20. min
CapillaryDB-51482.Isidorov, Zenkevich, et al., 199830. m/0.25 mm/0.25 μm, 3. K/min; Tstart: 50. C; Tend: 250. C
CapillaryDB-51459.Nogueira, Marsaioli, et al., 199830. m/0.25 mm/0.25 μm, H2, 3. K/min; Tstart: 60. C; Tend: 240. C
CapillaryBP-11447.Mariotti, Costa, et al., 199750. m/0.22 mm/0.25 μm, He, 2. K/min, 230. C @ 35. min; Tstart: 60. C
CapillaryBP-11441.Mariotti, Tomi, et al., 199750. m/0.22 mm/0.25 μm, He, 2. K/min, 230. C @ 35. min; Tstart: 60. C
CapillaryHP-1011451.Chung, Eiserich, et al., 1993N2, 3. K/min; Column length: 50. m; Column diameter: 0.25 mm; Tstart: 70. C; Tend: 200. C
CapillaryOV-11444.De Pooter, Omar, et al., 198530. m/0.5 mm/0.8 μm, He, 2. K/min; Tstart: 40. C; Tend: 220. C
CapillaryOV-11447.De Pooter, Omar, et al., 198530. m/0.5 mm/0.8 μm, He, 2. K/min; Tstart: 40. C; Tend: 220. C

Van Den Dool and Kratz RI, non-polar column, custom temperature program

View large format table.

Column type Active phase I Reference Comment
CapillaryHP-5MS1468.5Andriamaharavo, 201430. m/0.25 mm/0.25 μm, He; Program: 60C (1 min) => 5 C/min => 210C => 10 C/min => 280C (15 min)
CapillaryBPX-51467.Cardeal, da Silva, et al., 200630. m/0.25 mm/0.25 μm; Program: 35C(5min) => 3C/min => 210C => 40C/min => 240C (4min)
CapillaryDB-5MS1453.Zheng, Kim, et al., 200530. m/0.25 mm/0.25 μm, He; Program: 40 (5min) => 4C/min => 140C => 4C/min => 200C (20min)
CapillaryDB-5MS1459.Kim, Lee, et al., 200330. m/0.25 mm/0.25 μm, He; Program: 40C(5min) => 4C/min => 160C => 8C/min => 240C (15min)
CapillarySE-521455.Lorenzo, Loayza, et al., 200325. m/0.25 mm/0.25 μm, He; Program: 60C(8min) => 3C/min => 180C => 20C/min => 230C

Van Den Dool and Kratz RI, polar column, temperature ramp

View large format table.

Column type Active phase I Reference Comment
CapillaryBP-201663.Boti, Koukoua, et al., 200750. m/0.22 mm/0.25 μm, He, 2. K/min, 220. C @ 20. min; Tstart: 60. C
CapillaryBP-201664.Duquesnoy, Castola, et al., 200750. m/0.22 mm/0.25 μm, He, 2. K/min, 220. C @ 20. min; Tstart: 60. C
CapillaryHP-Innowax1672.Kundakovic, Fokialakis, et al., 200730. m/0.25 mm/0.25 μm, He, 3. K/min; Tstart: 60. C; Tend: 280. C
CapillaryRTX-Wax1665.Paolini J., Costa J., et al., 200760. m/0.22 mm/0.25 μm, He, 2. K/min, 230. C @ 35. min; Tstart: 60. C
CapillaryRTX-Wax1665.Paolini, Muselli, et al., 200760. m/0.22 mm/0.25 μm, He, 2. K/min, 230. C @ 35. min; Tstart: 60. C
CapillaryBP-201662.Boti, Bighelli, et al., 200650. m/0.22 mm/0.25 μm, He, 2. K/min, 220. C @ 20. min; Tstart: 60. C
CapillaryRTX-Wax1666.Cavalli, Tomi, et al., 200660. m/0.22 mm/0.25 μm, He, 2. K/min, 230. C @ 45. min; Tstart: 60. C
CapillaryHP-Wax1661.Flamini, Tebano, et al., 200630. m/0.25 mm/0.25 μm, N2, 60. C @ 10. min, 5. K/min; Tend: 220. C
CapillaryBP-201667.Gonny, Cavaleiro, et al., 200650. m/0.22 mm/0.25 μm, He, 2. K/min, 220. C @ 20. min; Tstart: 60. C
CapillarySupelcowax-101666.Pinto, Pina-Vaz, et al., 200630. m/0.2 mm/0.2 μm, He, 3. K/min, 220. C @ 15. min; Tstart: 70. C
CapillaryPEG-20M1668.Rubiolo P., Matteodo M., et al., 200625. m/0.25 mm/0.3 μm, He, 50. C @ 1. min, 3. K/min, 220. C @ 5. min
CapillaryBP-201664.Boti J.B., Koukoua G., et al., 200550. m/0.22 mm/0.25 μm, He, 2. K/min, 220. C @ 20. min; Tstart: 60. C
CapillaryDB-Wax1674.Choi, 200560. m/0.25 mm/0.25 μm, N2, 70. C @ 2. min, 2. K/min, 230. C @ 20. min
CapillaryDB-Wax1661.Fanciullino, Gancel, et al., 200530. m/0.25 mm/0.25 μm, He, 3. K/min, 250. C @ 20. min; Tstart: 40. C
CapillaryBP-201661.Ferrari, Tomi, et al., 200550. m/0.22 mm/0.25 μm, He, 2. K/min, 220. C @ 20. min; Tstart: 60. C
CapillaryDB-Wax1660.Gancel, Ollitrault, et al., 200530. m/0.25 mm/0.25 μm, He, 3. K/min, 250. C @ 20. min; Tstart: 40. C
CapillaryDB-Wax1657.Seo and Baek, 200530. m/0.25 mm/0.25 μm, He, 2. K/min, 200. C @ 20. min; Tstart: 40. C
CapillaryMegawax1649.Verzera, Trozzi, et al., 200530. m/0.25 mm/0.25 μm, He, 40. C @ 6. min, 2. K/min, 220. C @ 10. min
CapillarySupelcowax-101664.Cavaleiro, Salgueiro, et al., 200430. m/0.2 mm/0.2 μm, He, 3. K/min, 220. C @ 15. min; Tstart: 70. C
CapillaryHP-Wax1668.Flamini, Bader, et al., 200430. m/0.25 mm/0.25 μm, He, 3. K/min; Tstart: 60. C; Tend: 240. C
CapillaryHP-Wax1648.Flamini, Luigi Cioni, et al., 200430. m/0.25 mm/0.25 μm, N2, 60. C @ 10. min, 5. K/min; Tend: 220. C
CapillaryBP-201663.Gonny, Bradesi, et al., 200450. m/0.22 mm/0.25 μm, 2. K/min, 220. C @ 20. min; Tstart: 60. C
CapillaryDB-Wax1659.Zheng, Kim, et al., 200430. m/0.25 mm/0.25 μm, He, 40. C @ 5. min, 4. K/min, 200. C @ 20. min
CapillaryHP-Wax1670.Bader, Caponi, et al., 200330. m/0.25 mm/0.25 μm, N2, 60. C @ 10. min, 5. K/min; Tend: 220. C
CapillaryRTX-Wax1656.Cavalli, Tomi, et al., 200360. m/0.22 mm/0.25 μm, He, 2. K/min, 230. C @ 45. min; Tstart: 60. C
CapillaryDB-Wax1674.Choi, 200360. m/0.25 mm/0.25 μm, N2, 70. C @ 2. min, 2. K/min, 230. C @ 20. min
CapillaryDB-Wax1660.Gancel, Ollitrault, et al., 200360. m/0.32 mm/0.25 μm, H2, 1.5 K/min, 245. C @ 20. min; Tstart: 40. C
CapillaryCP-Wax 52CB1650.Kjeldsen, Christensen, et al., 200350. m/0.25 mm/0.2 μm, He, 32. C @ 1. min, 1. K/min; Tend: 220. C
CapillaryHP-Innowax1668.Skaltsa, Demetzos, et al., 200330. m/0.25 mm/0.5 μm, He, 3. K/min; Tstart: 60. C; Tend: 260. C
CapillaryDB-Wax1664.Choi, Kim. M.-S.L., et al., 200260. m/0.25 mm/0.25 μm, N2, 2. K/min, 230. C @ 20. min; Tstart: 70. C
CapillaryBP-201654.Lota, de Rocca Serra, et al., 200250. m/0.22 mm/0.25 μm, He, 2. K/min, 220. C @ 20. min; Tstart: 60. C
CapillaryRTX-Wax1653.Shellie, Mondello, et al., 200230. m/0.25 mm/0.25 μm, He, 45. C @ 6. min, 3. K/min; Tend: 250. C
CapillaryRTX-Wax1668.Shellie, Mondello, et al., 200230. m/0.25 mm/0.25 μm, He, 45. C @ 6. min, 3. K/min; Tend: 250. C
CapillaryBP-201661.Bianchini, Tomi, et al., 200150. m/0.22 mm/0.25 μm, He, 2. K/min, 230. C @ 35. min; Tstart: 60. C
CapillaryCP-Wax 52CB1650.Kjeldsen, Christensen, et al., 200150. m/0.25 mm/0.2 μm, 32. C @ 1. min, 1. K/min; Tend: 220. C
CapillaryDB-Wax1667.Bartley and Jacobs, 200060. m/0.5 mm/0.32 μm, He, 40. C @ 2. min, 4. K/min, 290. C @ 5. min
CapillaryDB-Wax1673.Choi and Sawamura, 200060. m/0.25 mm/0.25 μm, N2, 70. C @ 2. min, 2. K/min, 230. C @ 20. min
CapillarySupelcowax-101668.Lazari, Skaltsa, et al., 200030. m/0.32 mm/0.25 μm, He, 2.5 K/min; Tstart: 75. C; Tend: 200. C
CapillaryBP-201654.Lota, de Rocca Serra, et al., 200050. m/0.22 mm/0.25 μm, He, 2. K/min, 230. C @ 35. min; Tstart: 60. C
CapillaryBP-201654.Lota, Serra, et al., 199950. m/0.22 mm/0.25 μm, He, 2. K/min, 230. C @ 35. min; Tstart: 60. C
CapillaryBP-201654.Lota, Serra, et al., 199950. m/0.22 mm/0.25 μm, He, 2. K/min, 230. C @ 35. min; Tstart: 60. C
CapillaryBP-201658.Mazzoni, Tomi, et al., 199950. m/0.22 mm/0.25 μm, He, 2. K/min, 220. C @ 20. min; Tstart: 60. C
CapillaryCarbowax 20M1676.Bicchi, Rubiolo, et al., 199825. m/0.25 mm/0.3 μm, H2, 50. C @ 1. min, 3. K/min, 200. C @ 20. min
CapillaryBP-201658.Mariotti, Costa, et al., 199750. m/0.22 mm/0.25 μm, He, 2. K/min, 230. C @ 35. min; Tstart: 60. C
CapillaryBP-201660.Mariotti, Tomi, et al., 199750. m/0.22 mm/0.25 μm, He, 2. K/min, 230. C @ 35. min; Tstart: 60. C
CapillaryHP-20M1658.Chung, Eiserich, et al., 1993He, 3. K/min; Column length: 50. m; Column diameter: 0.25 mm; Tstart: 60. C; Tend: 190. C
CapillaryHP-FFAP1711.Chung, Eiserich, et al., 1993He, 3. K/min; Column length: 50. m; Column diameter: 0.25 mm; Tstart: 60. C; Tend: 210. C

Van Den Dool and Kratz RI, polar column, custom temperature program

View large format table.

Column type Active phase I Reference Comment
CapillaryCarbowax 20M1668.Bortolomeazzi, Berno, et al., 200130. m/0.25 mm/0.25 μm, He; Program: 60C(3min) => 4C/min => 160C => 10C/min => 280C
CapillaryCarbowax 20M1668.Bortolomeazzi, Pizzale, et al., 200030. m/0.25 mm/0.25 μm, He; Program: 60C(3min) => 4C/min => 160C => 10C/min => 280C

Normal alkane RI, non-polar column, temperature ramp

View large format table.

Column type Active phase I Reference Comment
CapillaryPolydimethyl siloxane with 5 % Ph1458.Priya, Prathapan, et al., 2012Helium, 5. K/min, 200. C @ 25. min; Column length: 30. m; Tstart: 80. C
CapillaryHP-51457.Bertoli, Lepnardi, et al., 201130. m/0.25 mm/0.25 μm, Helium, 3. K/min; Tstart: 60. C; Tend: 240. C
CapillaryDB-51442.Osorio, Carriazo, et al., 201130. m/0.32 mm/0.25 μm, Helium, 50. C @ 4. min, 4. K/min, 300. C @ 5. min
CapillaryHP-5 MS1461.Ogunwande, Flamini, et al., 201030. m/0.25 mm/0.25 μm, Helium, 60. C @ 10. min, 5. K/min; Tend: 220. C
CapillaryHP-51460.Radulovic, Dordevic, et al., 201030. m/0.25 mm/0.25 μm, Hydrogen, 5. K/min; Tstart: 70. C; Tend: 290. C
CapillaryZB-51456.Alagarmalai, Nestel, et al., 200930. m/0.25 mm/0.25 μm, Helium, 60. C @ 2. min, 10. K/min, 230. C @ 10. min
CapillarySPB-51453.Gilani, Shah, et al., 200930. m/0.53 mm/0.50 μm, Nitrogen, 50. C @ 5. min, 3. K/min, 210. C @ 45. min
CapillaryDB-51458.Kazemi and Akhavani, 200950. m/0.20 mm/0.32 μm, Nitrogen, 60. C @ 3. min, 5. K/min; Tend: 220. C
CapillaryHP-51454.Maridass, 200925. m/0.20 mm/0.33 μm, Helium, 3. K/min, 240. C @ 7. min; Tstart: 60. C
CapillaryRTX-11446.Museli, Pau, et al., 200960. m/0.22 mm/0.25 μm, Helium, 2. K/min, 230. C @ 30. min; Tstart: 60. C
CapillaryRTX-11448.Museli, Pau, et al., 200960. m/0.22 mm/0.25 μm, Helium, 2. K/min, 230. C @ 30. min; Tstart: 60. C
CapillaryDB-51457.Scrivanti, Anton, et al., 200930. m/0.25 mm/0.25 μm, Nitrogen, 2. K/min; Tstart: 40. C; Tend: 230. C
CapillaryDB-51457.Shafaghat and Sadeghi, 200950. m/0.20 mm/0.32 μm, Nitrogen, 60. C @ 3. min, 5. K/min, 220. C @ 5. min
CapillaryHP-5 MS1457.Forero, Quijano, et al., 200830. m/0.25 mm/0.25 μm, Helium, 50. C @ 4. min, 4. K/min, 230. C @ 10. min
CapillarySLB-5 MS1451.Lo Presti, Sciarrone, et al., 200830. m/0.25 mm/0.25 μm, Helium, 50. C @ 2. min, 3. K/min, 250. C @ 10. min
CapillaryHP-5 MS1491.Sarikurkcu, Tepe, et al., 200830. m/0.25 mm/0.25 μm, Helium, 3. K/min; Tstart: 50. C; Tend: 240. C
CapillaryHP-5 MS1461.Szarka, Hethelyi, et al., 200830. m/0.25 mm/0.25 μm, Helium, 60. C @ 1. min, 10. K/min, 280. C @ 7. min
CapillaryHP-51432.Yassa and Akhani, 200830. m/0.25 mm/0.32 μm, Helium, 60. C @ 30. min, 5. K/min; Tend: 250. C
CapillaryHP-5MS1444.Basta, Pavlovic, et al., 200730. m/0.25 mm/0.25 μm, He, 3. K/min; Tstart: 60. C; Tend: 280. C
CapillaryDB-51479.Bos, Woerdenbag, et al., 200730. m/0.26 mm/0.25 μm, He, 3. K/min; Tstart: 60. C; Tend: 240. C
CapillaryHP-5 MS1454.Capetanos, Saroglou, et al., 200730. m/0.32 mm/0.25 μm, Helium, 60. C @ 5. min, 4. K/min; Tend: 280. C
CapillaryDB-51479.Elfami, Bos, et al., 200730. m/0.26 mm/0.25 μm, Helium, 3. K/min; Tstart: 60. C; Tend: 290. C
CapillaryHP-5MS1453.Ferhat, Meklati, et al., 200730. m/0.25 mm/0.25 μm, He, 60. C @ 8. min, 2. K/min, 250. C @ 15. min
CapillaryHP-5MS1450.Ferhat, Tigrine-Kordjani, et al., 200730. m/0.25 mm/0.25 μm, He, 60. C @ 8. min, 2. K/min, 250. C @ 15. min
CapillaryCol-Elite 5MS1469.Gudaityte and Venskutonis R.P., 200730. m/0.25 mm/0.25 μm, He, 3. K/min; Tstart: 30. C; Tend: 246. C
CapillaryHP-11460.Hachicha, Skanji, et al., 200730. m/0.25 mm/0.25 μm, He, 2. K/min, 240. C @ 20. min; Tstart: 60. C
CapillarySE-301441.Loizzo, Tundis, et al., 200730. m/0.25 mm/0.25 μm, He, 40. C @ 5. min, 5. K/min, 250. C @ 10. min
CapillaryHP-51444.Loizzo, Tundis, et al., 200730. m/0.25 mm/0.25 μm, He, 40. C @ 5. min, 5. K/min, 250. C @ 10. min
CapillaryAT-51445.Meccia, Rojas, et al., 200760. m/0.25 mm/0.25 μm, Helium, 4. K/min; Tstart: 60. C; Tend: 260. C
CapillaryDB-51456.Miyazawa and Tamura, 200730. m/0.25 mm/0.25 μm, He, 2. K/min; Tstart: 60. C; Tend: 240. C
CapillaryDB-51425.Moreno, Lima, et al., 200730. m/0.25 mm/0.25 μm, Helium, 3. K/min; Tstart: 60. C; Tend: 300. C
CapillaryDB-51459.Morteza-Semnani, Saeedi, et al., 200730. m/0.25 mm/0.25 μm, Helium, 4. K/min; Tstart: 60. C; Tend: 220. C
CapillaryHP-51459.Oliveira, Leitão, et al., 200725. m/0.2 mm/0.33 μm, H2, 3. K/min; Tstart: 60. C; Tend: 240. C
CapillaryMethyl Silicone1446.Ozcan and Chalchat, 2007Helium, 3. K/min; Column length: 50. m; Column diameter: 0.25 mm; Tstart: 50. C; Tend: 240. C
CapillaryDB-11452.Pala-Paul, Brophy, et al., 200750. m/0.25 mm/0.25 μm, He, 4. K/min; Tstart: 95. C; Tend: 240. C
CapillaryHP-51452.Ristic, Krivokuca-Dokic, et al., 200730. m/0.25 mm/0.25 μm, Helium, 4. K/min; Tstart: 40. C; Tend: 260. C
CapillaryHP-5 MS1458.Rojas, Velasco, et al., 200760. m/0.25 mm/0.25 μm, Hydrogen, 4. K/min, 260. C @ 20. min; Tstart: 60. C
CapillaryDB-11476.Sonboli, Kanani, et al., 200760. m/0.25 mm/0.25 μm, Nitrogen, 5. K/min, 250. C @ 10. min; Tstart: 60. C
CapillaryElite-5MS1453.Tava, Pecetti, et al., 200730. m/0.32 mm/0.5 μm, He, 40. C @ 5. min, 4. K/min, 280. C @ 10. min
CapillaryHP-5MS1446.Vichi, Riu-Aumatell, et al., 200730. m/0.25 mm/0.25 μm, He, 40. C @ 5. min, 3. K/min, 250. C @ 10. min
CapillaryHP-51432.Yassa and Akhani, 200730. m/0.25 mm/0.32 μm, He, 60. C @ 30. min, 5. K/min; Tend: 250. C
CapillaryDB-51448.Apel, Sobral, et al., 200630. m/0.25 mm/0.25 μm, He, 3. K/min; Tstart: 60. C; Tend: 300. C
CapillaryCP Sil 5 CB1446.Ayoub, Al-Azizi, et al., 2006He, 10. K/min; Column length: 25. m; Tstart: 80. C; Tend: 270. C
CapillaryDB-51455.Bazargani, Almasirad, et al., 200630. m/0.25 mm/0.25 μm, He, 50. C @ 1. min, 2.5 K/min, 265. C @ 20. min
CapillaryDB-51451.Choi, 200630. m/0.25 mm/0.25 μm, N2, 70. C @ 2. min, 2. K/min, 230. C @ 20. min
CapillaryDB-51458.Damjanovic, Skala, et al., 200630. m/0.32 mm/0.25 μm, 3. K/min, 230. C @ 15. min; Tstart: 60. C
CapillaryHP-5MS1456.Ebrahim Sajjadi and Mehregan, 200630. m/0.25 mm/0.25 μm, 4. K/min; Tstart: 60. C; Tend: 280. C
CapillaryDB-51479.Elfami, Komar, et al., 200630. m/0.26 mm/0.25 μm, Helium, 3. K/min; Tstart: 60. C; Tend: 290. C
CapillaryBP-11448.Fanciullino, Tomi, et al., 200650. m/0.22 mm/0.25 μm, He, 2. K/min, 220. C @ 20. min; Tstart: 60. C
CapillaryHP-11443.Fernandez, Pintaric, et al., 200650. m/0.2 mm/0.33 μm, He, 2. K/min, 250. C @ 60. min; Tstart: 60. C
CapillaryDB-51462.Garneau F.X., Collin G., et al., 200630. m/0.25 mm/0.25 μm, 40. C @ 2. min, 2. K/min, 210. C @ 33. min
CapillaryDB-51455.Javidnia, Miri, et al., 200630. m/0.25 mm/0.25 μm, Helium, 3. K/min; Tstart: 60. C; Tend: 260. C
CapillaryHP-5MS1460.Kim, El-Aty, et al., 200630. m/0.25 mm/0.25 μm, He, 50. C @ 4. min, 5. K/min, 280. C @ 10. min
CapillaryHP-51460.Kucuk, Gulec, et al., 200630. m/0.32 mm/0.25 μm, Helium, 60. C @ 2. min, 5. K/min, 260. C @ 13. min
CapillaryRTX-11473.Kula, Izydorczyk, et al., 200630. m/0.32 mm/0.25 μm, He, 4. K/min; Tstart: 60. C; Tend: 300. C
CapillaryBP-11446.Lesueur, Ban, et al., 200650. m/0.22 mm/0.25 μm, He, 2. K/min, 220. C @ 20. min; Tstart: 60. C
CapillaryHP-1011488.Mastelic, Jerkovic, et al., 200625. m/0.2 mm/0.2 μm, He, 70. C @ 2. min, 3. K/min, 200. C @ 15. min
CapillaryDB-51458.Morteza-Semnani, Akbarzadeh, et al., 200630. m/0.25 mm/0.25 μm, He, 4. K/min; Tstart: 60. C; Tend: 220. C
CapillaryDB-51464.Nickavar B., Kamalinejad M., et al., 200630. m/0.25 mm/0.25 μm, 50. C @ 0.5 min, 2.5 K/min; Tend: 265. C
CapillaryDB-51465.Ouamba, Ouabonzi, et al., 200625. m/0.25 mm/0.15 μm, N2, 50. C @ 3. min, 4. K/min; Tend: 200. C
CapillaryHP-51456.Pintore G., Chessa M., et al., 200630. m/0.25 mm/0.25 μm, He, 60. C @ 10. min, 5. K/min; Tend: 220. C
CapillaryHP-51458.Pino, Sauri-Duch, et al., 200630. m/0.25 mm/0.25 μm, H2, 50. C @ 2. min, 4. K/min, 280. C @ 10. min
CapillaryDB-51450.Rout, Naik, et al., 200630. m/0.25 mm/0.25 μm, He, 2. K/min, 200. C @ 60. min; Tstart: 60. C
CapillaryDB-51454.Rout, Naik, et al., 200630. m/0.25 mm/0.25 μm, He, 2. K/min, 200. C @ 60. min; Tstart: 60. C
CapillaryDB-51448.Senatore, Landolfi, et al., 200630. m/0.25 mm/0.25 μm, He, 40. C @ 5. min, 2. K/min, 260. C @ 20. min
CapillaryCP Sil 5 CB1448.Tesso, König, et al., 2006H2, 3. K/min; Column length: 25. m; Column diameter: 0.25 mm; Tstart: 50. C; Tend: 230. C
CapillarySPB-11445.Wong, Lim, et al., 200650. m/0.2 mm/0.33 μm, He, 50. C @ 1. min, 4. K/min, 220. C @ 10. min
CapillaryHP-51458.Yayli, Gülec, et al., 200630. m/0.32 mm/0.25 μm, He, 60. C @ 2. min, 5. K/min, 260. C @ 14. min
CapillaryHP-51459.Yayli, Gülec, et al., 200630. m/0.32 mm/0.25 μm, He, 60. C @ 2. min, 5. K/min, 260. C @ 14. min
CapillaryDB-51450.Chagonda and Chalchat, 200525. m/0.25 mm/0.15 μm, 40. C @ 5. min, 3. K/min; Tend: 220. C
CapillaryHP-51455.Duarte, Figueira, et al., 200525. m/0.2 mm/0.33 μm, He, 3. K/min, 240. C @ 7. min; Tstart: 60. C
CapillaryDB-11460.Facundo, Pinto, et al., 200530. m/0.25 mm/0.25 μm, He, 60. C @ 5. min, 5. K/min, 250. C @ 15. min
CapillaryDB-11448.Fakhari, Salehi, et al., 200560. m/0.25 mm/0.25 μm, He, 5. K/min; Tstart: 60. C; Tend: 250. C
CapillaryDB-51453.Ferraz, Limberger, et al., 200530. m/0.25 mm/0.25 μm, He, 60. C @ 3. min, 3. K/min; Tend: 300. C
CapillaryDB-11442.Khanavi, Ghasemian, et al., 200530. m/0.25 mm/0.25 μm, He, 50. C @ 1. min, 2.5 K/min, 265. C @ 20. min
CapillaryHP-5MS1465.Melkani, Dev, et al., 200530. m/0.25 mm/0.25 μm, 50. C @ 10. min, 3. K/min, 250. C @ 5. min
CapillaryDB-51457.Morteza-Semnani and Saeedi, 200530. m/0.25 mm/0.25 μm, He, 60. C @ 4. min, 4. K/min; Tend: 220. C
CapillaryDB-11452.Palá-Paúl, Pérez-Alonso, et al., 200550. m/0.25 mm/0.25 μm, N2, 4. K/min; Tstart: 95. C; Tend: 240. C
CapillaryDB-11452.Pala-Paul, Perez-Alonso, et al., 200550. m/0.25 mm/0.25 μm, N2, 4. K/min; Tstart: 95. C; Tend: 240. C
CapillaryHP-5MS1457.Petrakis, Roussis, et al., 20053. K/min; Column length: 30. m; Column diameter: 0.2 mm; Tstart: 60. C; Tend: 280. C
CapillaryHP-51458.Saeidnia, Gohari, et al., 2005He, 5. K/min; Column length: 30. m; Column diameter: 0.25 mm; Tstart: 60. C; Tend: 240. C
CapillaryHP-5MS1459.Sajjadi, 200530. m/0.25 mm/0.25 μm, He, 4. K/min; Tstart: 60. C; Tend: 280. C
CapillaryDB-11445.Sarkhail, Amin, et al., 200530. m/0.25 mm/0.25 μm, He, 50. C @ 1. min, 2.5 K/min, 265. C @ 20. min
CapillaryHP-5MS1460.Setzer, Noletto, et al., 200530. m/0.25 mm/0.25 μm, He, 60. C @ 5. min, 3. K/min; Tend: 280. C
CapillaryPE-51448.Singh, Raina, et al., 200530. m/0.32 mm/0.25 μm, H2, 60. C @ 2. min, 5. K/min, 230. C @ 4. min
CapillaryHP-5MS1458.Slavkovska, Couladis, et al., 200530. m/0.25 mm/0.25 μm, He, 3. K/min; Tstart: 60. C; Tend: 280. C
CapillaryRTX-51457.Szafranek, Chrapkowska, et al., 200530. m/0.25 mm/0.25 μm, 3. K/min; Tstart: 60. C; Tend: 220. C
CapillaryDB-51421.Tzakou and Constantinidis, 200530. m/0.32 mm/0.25 μm, He, 3. K/min; Tstart: 60. C; Tend: 280. C
CapillaryDB-11438.Velasco-Negueruela, Pérez-Alonso, et al., 200550. m/0.25 mm/0.25 μm, N2, 4. K/min; Tstart: 90. C; Tend: 240. C
CapillaryHP-5MS1446.Vichi, Riu-Aumatell, et al., 200530. m/0.25 mm/0.25 μm, 40. C @ 5. min, 3. K/min, 220. C @ 10. min
CapillarySPB-11448.Wong, Lee, et al., 200550. m/0.2 mm/0.33 μm, He, 50. C @ 3. min, 4. K/min, 220. C @ 30. min
CapillaryDB-51457.Cicció, 200430. m/0.25 mm/0.25 μm, He, 2. K/min; Tstart: 60. C; Tend: 240. C
CapillaryDB-11445.Fekam Boyom, Fotio, et al., 200430. m/0.25 mm/0.25 μm, N2, 5. K/min; Tstart: 50. C; Tend: 200. C
CapillarySPB-51464.Gauvin, Ravaomanarivo, et al., 200460. m/0.32 mm/1. μm, He, 4. K/min, 200. C @ 30. min; Tstart: 60. C
CapillaryDB-51458.González, Guerra, et al., 200430. m/0.25 mm/0.25 μm, N2, 2. K/min; Tstart: 40. C; Tend: 230. C
CapillaryDB-51458.JAvidnia, Mojab, et al., 200425. m/0.25 mm/0.25 μm, Nitrogen, 3. K/min; Tstart: 60. C; Tend: 240. C
CapillaryHP-5MS1443.Li and Jiang, 200430. m/0.25 mm/0.25 μm, He, 50. C @ 2. min, 5. K/min, 230. C @ 10. min
CapillaryDB-5MS1427.Marongiu, Piras, et al., 200430. m/0.25 mm/0.25 μm, He, 3. K/min, 280. C @ 30. min; Tstart: 60. C
CapillaryHP-5MS1463.Mehrabani, Asadipour, et al., 200430. m/0.25 mm/0.25 μm, He, 4. K/min; Tstart: 60. C; Tend: 275. C
CapillaryNB-301453.Orav, Stulova, et al., 200450. m/0.2 mm/0.25 μm, He, 2. K/min; Tstart: 50. C; Tend: 250. C
CapillaryNB-301450.Orav, Stulova, et al., 200450. m/0.2 mm/0.25 μm, He, 2. K/min; Tstart: 50. C; Tend: 250. C
CapillaryNB-301448.Raal, Paaver, et al., 200450. m/0.20 mm/0.25 μm, He, 2. K/min; Tstart: 50. C; Tend: 250. C
CapillaryDB-11445.Sarkhail, Amin, et al., 200430. m/0.25 mm/0.25 μm, He, 50. C @ 1. min, 2.5 K/min, 265. C @ 20. min
CapillaryDB-11457.Sawamura, Son, et al., 200460. m/0.25 mm/0.25 μm, 70. C @ 2. min, 2. K/min, 230. C @ 20. min
CapillaryDB-51457.Tirillini, Pellegrino, et al., 200430. m/0.25 mm/0.25 μm, He, 3. K/min; Tstart: 60. C; Tend: 300. C
CapillaryHP-51450.Bertoli, Menichini, et al., 200330. m/0.25 mm/0.25 μm, N2, 60. C @ 10. min, 5. K/min; Tend: 220. C
CapillaryHP-5MS1468.Feizbaksh, Saber Tehrani, et al., 200330. m/0.25 mm/0.25 μm, He, 60. C @ 20. min, 5. K/min, 220. C @ 20. min
CapillaryHP-11445.Fekam Boyom, Amvam Zollo, et al., 200330. m/0.25 mm/0.25 μm, He, 10. K/min; Tstart: 70. C; Tend: 200. C
CapillaryHP-51464.Ghannadi and Zolfaghari, 200330. m/0.25 mm/0.25 μm, He, 4. K/min; Tstart: 60. C; Tend: 275. C
CapillaryRSL-2001455.Jirovetz, Buchbauer, et al., 200330. m/0.32 mm/0.25 μm, H2, 40. C @ 5. min, 6. K/min, 280. C @ 5. min
CapillaryRSL-2001451.Jirovetz, Buchbauer, et al., 2003, 230. m/0.32 mm/0.25 μm, H2, 40. C @ 5. min, 6. K/min, 280. C @ 5. min
CapillaryDB-51460.Masotti, Juteau, et al., 200350. m/0.2 mm/0.25 μm, He, 50. C @ 2. min, 3. K/min; Tend: 220. C
CapillaryHP-51457.Mookdasanit, Tamura, et al., 2003Helium, 2. K/min, 210. C @ 60. min; Column length: 30. m; Column diameter: 0.32 mm; Tstart: 70. C
CapillaryDB-11458.Perez-Alonso, Velasco-Negueruela, et al., 200350. m/0.25 mm/0.25 μm, N2, 4. K/min; Tstart: 95. C; Tend: 240. C
CapillaryDB-51460.Priestap, van Baren, et al., 200330. m/0.2 mm/0.25 μm, He, 75. C @ 4. min, 3. K/min; Tend: 220. C
CapillaryNB-301450.Raal, Arak, et al., 200350. m/0.2 mm/0.5 μm, He, 2. K/min; Tstart: 50. C; Tend: 250. C
CapillaryHP-51460.Sajjadi and Mehregan, 200330. m/0.25 mm/0.25 μm, He, 4. K/min; Tstart: 60. C; Tend: 280. C
CapillaryHP-51455.Sajjadi and Mehregan, 2003, 230. m/0.25 mm/0.25 μm, He, 4. K/min; Tstart: 60. C; Tend: 280. C
CapillaryDB-51454.Senatore and Bruno, 200330. m/0.25 mm/0.25 μm, 40. C @ 5. min, 2. K/min; Tend: 260. C
CapillaryDB-11456.Tu, Onishi, et al., 200360. m/0.25 mm/0.25 μm, N2, 70. C @ 2. min, 2. K/min, 230. C @ 20. min
CapillaryDB-11457.Tu, Onishi, et al., 2003, 260. m/0.25 mm/0.25 μm, N2, 70. C @ 2. min, 2. K/min, 230. C @ 20. min
CapillaryCross-Linked Methylsilicone1438.Velasco-Negueruela, Pérez-Alonso, et al., 200325. m/0.2 mm/0.33 μm, He, 4. K/min; Tstart: 70. C; Tend: 250. C
CapillaryDB-51457.Zoghbi, Andrade, et al., 200330. m/0.25 mm/0.25 μm, He, 3. K/min; Tstart: 60. C; Tend: 240. C
CapillaryBP-11445.Das, Ram, et al., 200225. m/0.50 mm/0.25 μm, N2, 5. K/min, 220. C @ 10. min; Tstart: 60. C
CapillaryDB-51460.Flamini, Ertugrul, et al., 200230. m/0.25 mm/0.25 μm, He, 3. K/min; Tstart: 60. C; Tend: 240. C
CapillaryDB-11438.Gancel, Ollé, et al., 200230. m/0.32 mm/0.25 μm, H2, 40. C @ 20. min, 3. K/min; Tend: 245. C
CapillaryRSL-2001445.Jirovetz, Buchbauer, et al., 200230. m/0.32 mm/0.25 μm, H2, 40. C @ 5. min, 6. K/min, 280. C @ 5. min
CapillaryRSL-2001442.Jirovetz, Ngassoum, et al., 200230. m/0.32 mm/0.25 μm, H2, 50. C @ 5. min, 6. K/min, 280. C @ 5. min
CapillaryCP Sil 8 CB1461.Juteau, Masotti, et al., 200230. m/0.25 mm/0.25 μm, He, 50. C @ 2. min, 3. K/min; Tend: 220. C
CapillaryDB-5MS1460.Maia, Zoghbi, et al., 200230. m/0.25 mm/0.25 μm, He, 3. K/min; Tstart: 60. C; Tend: 240. C
CapillaryDB-11431.Palá-Paúl, Pérez-Alonso, et al., 200250. m/0.25 mm/0.25 μm, N2, 4. K/min; Tstart: 80. C; Tend: 225. C
CapillaryDB-51459.Schwob, Bessière, et al., 2002He, 3. K/min; Column length: 25. m; Column diameter: 0.2 mm; Tstart: 60. C; Tend: 220. C
CapillarySPB-51458.Cornu, Carnat, et al., 2001He, 40. C @ 5. min, 3. K/min, 220. C @ 15. min; Column length: 60. m; Column diameter: 0.32 mm
CapillaryHP-51455.Gallori, Flamini, et al., 200130. m/0.25 mm/0.25 μm, N2, 60. C @ 10. min, 5. K/min; Tend: 220. C
CapillaryOptima-51457.Jacquemond-Collet, Bessière, et al., 2001He, 50. C @ 3. min, 3. K/min; Column length: 30. m; Column diameter: 0.2 mm; Tend: 250. C
CapillaryOV-1011445.Orav, Kailas, et al., 200150. m/0.2 mm/0.5 μm, He, 2. K/min; Tstart: 50. C; Tend: 250. C
CapillaryDB-11435.Palá-Paúl, Pérez-Alonso, et al., 200130. m/0.25 mm/0.25 μm, N2, 4. K/min; Tstart: 80. C; Tend: 225. C
CapillaryDB-11467.0Santos, Moreira, et al., 2001He, 3. K/min; Column length: 30. m; Column diameter: 0.2 mm; Tstart: 60. C; Tend: 240. C
CapillaryPTE-51458.Stojanovic, Palic, et al., 200160. m/0.32 mm/0.3 μm, H2, 4.3 K/min; Tstart: 60. C; Tend: 285. C
CapillaryCP Sil 5 CB1438.Asekun and Ekundayo, 200025. m/0.25 mm/0.15 μm, 3. K/min; Tstart: 50. C; Tend: 230. C
CapillaryDB-11450.Feger, Brandauer, et al., 200033. m/0.25 mm/0.50 μm, N2, 50. C @ 2. min, 20. K/min; Tend: 135. C
CapillarySPB-11459.Fraternale, Giamperi, et al., 200030. m/0.2 mm/0.2 μm, He, 80. C @ 3. min, 5. K/min; Tend: 300. C
CapillaryRSL-2001436.Jirovetz, Puschmann, et al., 200060. m/0.32 mm/0.25 μm, H2, 6. K/min; Tstart: 40. C; Tend: 250. C
CapillaryDB-51454.Mitiku, Sawamura, et al., 200030. m/0.22 mm/0.25 μm, N2, 70. C @ 2. min, 4. K/min, 230. C @ 20. min
CapillaryOV-1011448.Kuiate, Zollo, et al., 1999, 25. K/min; Column length: 25. m; Column diameter: 0.32 mm; Tstart: 50. C; Tend: 200. C
CapillaryOV-11444.Oberhofer, Nikiforov, et al., 199925. m/0.25 mm/0.25 μm, H2, 40. C @ 5. min, 3. K/min, 220. C @ 5. min
CapillaryDB-11435.Palá-Paúl, Pérez-Alonso, et al., 199950. m/0.25 mm/0.25 μm, He, 4. K/min; Tstart: 70. C; Tend: 240. C
CapillaryDB-51458.Tellez, Canel, et al., 199930. m/0.25 mm/0.25 μm, He, 3. K/min; Tstart: 60. C; Tend: 240. C
CapillaryCP Sil 5 CB1449.Weyerstahl, Marschall, et al., 1999N2, 5. K/min; Column length: 25. m; Phase thickness: 0.39 μm; Tstart: 60. C; Tend: 220. C
CapillaryDB-51459.Zoghbi, Andrade, et al., 199930. m/0.25 mm/0.25 μm, He, 3. K/min; Tstart: 60. C; Tend: 240. C
CapillaryOV-1011454.Zollo, Biyiti, et al., 19985. K/min; Column length: 25. m; Column diameter: 0.32 mm; Tstart: 50. C; Tend: 200. C
CapillaryMethyl Silicone1448.Gopalakrishnan, Menon, et al., 199350. m/0.25 mm/0.17 μm, N2, 2. K/min; Tstart: 80. C; Tend: 200. C
CapillaryMethyl Silicone1445.Gopalakrishnan, Menon, et al., 199350. m/0.25 mm/0.17 μm, N2, 3. K/min; Tstart: 80. C; Tend: 200. C
CapillarySE-541458.Kollmannsberger, Nitz, et al., 199230. m/0.25 mm/0.25 μm, Hydrogen, 60. C @ 5. min, 2. K/min, 250. C @ 2. min
CapillaryDB-11447.Binder, Benson, et al., 19904. K/min, 230. C @ 10. min; Column length: 60. m; Column diameter: 0.32 mm; Tstart: 50. C
CapillaryDB-11447.Binder, Turner, et al., 19904. K/min, 230. C @ 10. min; Tstart: 50. C
CapillaryDB-11447.Binder, Turner, et al., 1990, 24. K/min, 230. C @ 10. min; Column length: 60. m; Column diameter: 0.32 mm; Tstart: 50. C
CapillaryCP Sil 8 CB1494.Jantan and Goh, 199060. C @ 10. min, 3. K/min; Column length: 25. m; Column diameter: 0.20 mm; Tend: 230. C
CapillaryOV-31450.Buttery, Flath, et al., 1986He, 1. K/min; Column length: 150. m; Column diameter: 0.66 mm; Tstart: 30. C; Tend: 170. C
CapillaryOV-11448.Schreyen, Dirinck, et al., 1979N2, 1. K/min; Column length: 183. m; Column diameter: 0.762 mm; Tstart: 0. C; Tend: 230. C

Normal alkane RI, non-polar column, custom temperature program

View large format table.

Column type Active phase I Reference Comment
CapillaryPolydimethyl siloxane with 5 % Ph groups1455.Robinson, Adams, et al., 2012Program: not specified
CapillaryPolydimethyl siloxane with 5 % Ph groups1455.Robinson, Adams, et al., 2012Program: not specified
CapillaryCP-Sil 5 CB1486.Gros, Nizet, et al., 201150. m/0.32 mm/1.20 μm, Nitrogen; Program: 36 0C 20 0C/min -> 85 0C 1 0C/min -> 145 0C 3 0C/min -> 250 0C (30 min)
CapillaryDB-51460.Miyazaki, Plotto, et al., 201160. m/0.25 mm/1.00 μm, Helium; Program: 40 0C 4 0C/min -> 230 0C 100 0C/min -> 260 0C (11.7 min)
CapillaryHP-5 MS1415.Bagci, Yazgin, et al., 201030. m/0.25 mm/0.25 μm, Helium; Program: 70 0C (2 min) 10 0C/min -> 150 0C (15 min) 5 0C/min -> 240 0C
CapillaryHP-5 MS1438.Liu, Chu, et al., 201030. m/0.25 mm/0.25 μm, Helium; Program: 60 0C (1 min) 10 0C/min -> 180 0C (1 min) 20 0C/min -> 280 0C (15 min)
CapillaryZB-1 MS1440.Bajpai, Al-Reza, et al., 200930. m/0.25 mm/0.25 μm, Helium; Program: 50 0C 3 0C/min -> 150 0C (10 min) 10 0C/min -> 250 0C
CapillaryDB-51461.Courtois, Paine, et al., 200930. m/0.25 mm/0.25 μm, Helium; Program: 50 0C m6 0C/min -> 140 0C 5 0C/min -> 160 0C (1 min) 10 0C/min -> 200 0C
CapillaryHP-51454.Custer, 200925. m/0.32 mm/0.17 μm, Helium; Program: 60 0C (5 min) 4 0C/min -> 220 0C 11 0C/min -> 280 0C (15 min)
CapillaryHP-51456.Custer, 200925. m/0.32 mm/0.17 μm, Helium; Program: not specified
CapillaryOptima-5MS1456.HEuskin, Godin, et al., 200930. m/0.32 mm/0.25 μm, Helium; Program: 40 0C (5 min) 5 0C/min -> 230 0C 30 0C/min -> 280 0C (5 min)
CapillaryElite-5 MS1446.Kapoor, Singh, et al., 200930. m/0.25 mm/0.25 μm, Helium; Program: 60 0C (1 min) 1.5 0C/min -> 185 0C (1 min) 9 0C/min -> 275 0C (2 min)
CapillaryDB-11455.Mendes, Trindade, et al., 200930. m/0.25 mm/0.25 μm, Hydrogen; Program: 45 0C 3 0C/min -> 175 0C 15 0C/min -> 300 0C (10 min)
CapillaryDB-11455.Mendes, Trindade, et al., 2009, 230. m/0.25 mm/0.25 μm, Hydrogen; Program: 45 0C 3 0C/min -> 175 0C 15 0C/min -> 300 0C (10 min)
CapillaryHP-51457.Riahi, Pourbasheer, et al., 2009Column length: 30. m; Column diameter: 0.32 mm; Program: not specified
CapillaryHP-5 MS1457.Zellner, Amorim, et al., 200930. m/0.25 mm/0.25 μm, Helium; Program: 32 0C (1 min) 50 0C/min -> 115 0C 1.5 0C/min -> 145 0C 12 0C/min -> 240 0C (10 min)
CapillaryDB-51456.Judzentiene and Budiene, 200850. m/0.32 mm/0.25 μm, Helium; Program: 60 0C (2 min) 5 0C/min -> 160 0C (1 min) 10 0C/min -> 250 0C (3 min)
CapillaryCB-11467.Kannaste, Vongvanich, et al., 200830. m/0.25 mm/0.25 μm, Helium; Program: 40 0C (2 min) 4 0C/min -> 180 0C 20 0C/min -> 220 0C (1 min)
CapillaryCB-11446.Kannaste, Vongvanich, et al., 200830. m/0.25 mm/0.25 μm, Helium; Program: not specified
CapillaryCP Sil 8 CB1458.Kristiawan, Sobolik, et al., 200830. m/0.25 mm/0.25 μm; Program: 60C => 2.5C/min => 170C => 10C/min => 250C (5min)
CapillarySLB-5 MS1450.Lo Presti, Sciarrone, et al., 200830. m/0.25 mm/0.25 μm, Helium; Program: not specified
CapillaryDB-11455.Nogueira, Marcelo-Curto, et al., 200830. m/0.25 mm/0.25 μm, He; Program: 45C => 3C/min => 175C => 15C/min => 300C (10min)
CapillaryCP-Sil 8CB-MS1454.Profitt, Schatz, et al., 200830. m/0.25 mm/0.25 μm, Helium; Program: 50 0C(3 min) 3 0C/min -> 100 0C 2.7 0C/min -> 140 0C 2.4 0C/min -> 180 0C 6 0C/min -> 260 0C
CapillaryHP-11439.Barra, Baldovini, et al., 200750. m/0.2 mm/0.33 μm, He; Program: 40C(2min) => 2C/min => 200C => 15C/min => 250C (30min)
CapillaryHP-5MS1460.Cole, Haber, et al., 200730. m/0.25 mm/0.25 μm, He; Program: 40C(10min) => 3C/min => 200C => 2C/min => 220C
CapillaryHP-5MS1452.Formisano, Mignola, et al., 200730. m/0.25 mm/0.25 μm, He; Program: 40C(5min) => 2C/min => 250C(15min) => 10C/min => 270C
CapillaryHP-5 MS1452.Formisano, Rigano, et al., 200730. m/0.25 mm/0.25 μm, Helium; Program: 40 0C (5 min) 2 0C/min -> 250 0C (15 min) 10 0C/min -> 270 0C
CapillaryDB-5 MS1480.Haznagy-Radnai, Szigle, et al., 200730. m/0.25 mm/0.25 μm, Helium; Program: 60 0C 3 0C/min -> 210 0C 5 0C/min -> 250 0C
CapillaryDB-11455.Kamatou, Viljoen, et al., 200730. m/0.25 mm/0.25 μm, H2; Program: 45 0C 3 0C/min -> 175 0C 15 0C/min -> 300 0C (10 min)
CapillaryHP-51462.Liolios, Laouer, et al., 2007Program: not specified
CapillaryCP Sil 8 CB1452.Meekijjaroenroj, Bessière, et al., 200730. m/0.25 mm/0.25 μm, He; Program: 50C(3min) => 3C/min => 100C => 2.7C/min => 140C => 2.4C/min => 180C => 6C/min => 250C
CapillaryHP-5MS1461.Moronkola, Ogunwande, et al., 200730. m/0.25 mm/0.25 μm, He; Program: 40C(10min) => 3C/min => 200C => 2C/min => 220C
CapillaryCP-Sil1452.Proffit, 200730. m/0.25 mm/0.25 μm, Helium; Program: 50 0C (3 min) 3 0C/min -> 100 0C 2.7 0C/min -> 140 0C 2.4 0C/min -> 180 0C 6 0C/min -> 250 0C
CapillaryCP-Sil1454.Proffit, 200730. m/0.25 mm/0.25 μm, Helium; Program: 50 0C (3 min) 3 0C/min -> 100 0C 2.7 0C/min -> 140 0C 2.4 0C/min -> 180 0C 6 0C/min -> 250 0C
CapillaryCP-Sil1435.Proffit, 200730. m/0.25 mm/0.25 μm, Helium; Program: 50 0C (3 min) 3 0C/min -> 100 0C 2.7 0C/min -> 140 0C 2.4 0C/min -> 180 0C 6 0C/min -> 250 0C
CapillaryCP-Sil1454.Proffit, 200730. m/0.25 mm/0.25 μm, Helium; Program: 50 0C (3 min) 3 0C/min -> 100 0C 2.7 0C/min -> 140 0C 2.4 0C/min -> 180 0C 6 0C/min -> 250 0C
CapillaryCP Sil 8 CB1454.Radusiene, Judzentiene, et al., 200750. m/0.32 mm/0.25 μm, Helium; Program: 60 0C (2 min) 5 0C/min -> 160 0C (1 min) 10 0C/min -> 280 0C (3 min)
CapillaryHP-51457.Ristic, Krivokuca-Dokic, et al., 200730. m/0.25 mm/0.25 μm, Helium; Program: not specified
CapillaryDB-11456.Rodrigues, Antunes, et al., 200730. m/0.25 mm/0.25 μm, He; Program: 45C => 3C/min => 175C => 15C/min => 300C(10min)
CapillaryHP-5 MS1460.Stokes, Cole, et al., 2007Program: not specified
CapillaryHP-5MS1462.Takaku, Haber, et al., 2007He; Column length: 30. m; Column diameter: 0.25 mm; Program: 40C(10min) => 3C/min => 200C => 2C/min => 220C
CapillarySPB-51453.Chemat, Lucchesi, et al., 200660. m/0.32 mm/1. μm, He; Program: 60C => 1C/min => 130C => 2C/min => 200C => 4C/min => 250C (40min)
CapillaryCP Sil 8 CB1457.Judzentiene and Buzelyte, 200650. m/0.32 mm/0.25 μm, He; Program: 60C(2min) => 5C/min => 160C(1min) => 10C/min => 250C (5min)
CapillaryHP-51460.Kucuk, Gulec, et al., 200630. m/0.32 mm/0.25 μm, Helium; Program: not specified
CapillaryHP-5 MS1458.Schmidt, Noletto, et al., 200630. m/0.25 mm/0.25 μm, Helium; Program: 40 0C (10 min) 3 0C/min -> 200 0C 2 0C/min -> 220 0C
CapillaryHP-5MS1457.Singh, Marimuthu, et al., 200630. m/0.25 mm/0.25 μm, He; Program: 60C => 1.5C/min => 185C(1min) => 9C/min => 275C(2min)
CapillaryDB-51444.Srivastava, Mallavarapu, et al., 200630. m/0.32 mm/0.25 μm, He; Program: 60C => 2C/min => 100C => 3C/min => 160C => 5C/min => 280C
CapillarySE-521457.Tognolini, Barocelli, et al., 200630. m/0.32 mm/0.15 μm, He; Program: 45C => 1C/min => 100C => 5C/min => 250C (10min)
CapillaryCP Sil 8 CB1457.Butkienë, Nivinskienë, et al., 200550. m/0.32 mm/0.25 μm, He; Program: 50C(5min) => 2C/min => 90C => 15C/min => 240C(4min)
CapillaryBP-51452.Eyres, Dufour, et al., 200525. m/0.32 mm/0.50 μm, Helium; Program: 60 0C 6 0C/min -> 210 0C 10 0C/min -> 290 0C (10 min)
CapillaryBP-51456.Eyres, Dufour, et al., 200525. m/0.32 mm/0.50 μm, Helium; Program: 60 0C 6 0C/min -> 210 0C 10 0C/min -> 290 0C (10 min)
CapillaryBP-51462.Eyres, Dufour, et al., 200525. m/0.32 mm/0.50 μm, Helium; Program: 60 0C 6 0C/min -> 210 0C 10 0C/min -> 290 0C (10 min)
CapillaryHP-5MS1459.Novak, Draxler, et al., 200530. m/0.25 mm/0.25 μm; Program: 40C(5min) => 3C/min => 90C => 10C/min => 280C
CapillaryHP-51460.Singh, Maurya, et al., 2005Column length: 30. m; Column diameter: 0.32 mm; Program: 65C(1min) => 1C/min => 75C (2min) => 0.5C/min => 81C(2min) => 3C/min => 180C(7min)
CapillaryHP-51469.Yasar, Üçüncü, et al., 200530. m/0.25 mm/0.25 μm, He; Program: 60C(5min) => 3C/min => 120C (2min) => 2C/min => 200C (2min) => 3C/min => 320C
CapillaryCP Sil 8 CB1457.Butkienë, Nivinskienë, et al., 200450. m/0.32 mm/0.25 μm, He; Program: 50C(5min) => 2C/min => 90C => 15C/min => 240C(4min)
CapillaryHP-5MS1461.Demyttenaere, Moriña, et al., 200430. m/0.25 mm/0.25 μm, He; Program: 40C (2min) => 10C/min => 200C => 15C/min => 250C (5min)
CapillaryHP-5MS1461.Demyttenaere, Moriña, et al., 200430. m/0.25 mm/0.25 μm, He; Program: 40C (2min) => 10C/min => 200C => 15C/min => 250C (5min)
CapillaryBPX-51457.Koba, Sanda, et al., 200430. m/0.25 mm/0.25 μm, H2; Program: 50 0C (1 min) 3 0C/min -> 150 0C 5 0C/min -> 250 0C (5 min)
CapillaryHP-51452.Senatore, Apostolides Arnold, et al., 200430. m/0.25 mm/0.25 μm; Program: 40C(5min) => 2C/min => 250C(15min) => 10C/min => 270C
CapillaryHP-5MS1469.Singh, Marimuthu, et al., 200430. m/0.25 mm/0.25 μm; Program: 60C(1min) => 1.5C/min => 185C(1min) => 9C/min => 275C(2min)
CapillarySE-301482.Vinogradov, 2004Program: not specified
CapillarySE-541443.Kilic, 2002Program: not specified
CapillaryHP-51450.Usubillaga, Aparicio, et al., 200130. m/0.25 mm/0.25 μm, He; Program: 50 0C 3 K/min -> 200 0C 8 K/min -> 280 0C
CapillaryDB-11456.da Silva, Pedro, et al., 200030. m/0.25 mm/0.25 μm, H2; Program: 40 0C 3 K/min -> 175 0C 15 K/min -> 240 0C (10 min)
CapillaryHP-5MS1462.Bouwmeester, Wallaart, et al., 199930. m/0.25 mm/0.25 μm, He; Program: not specified
CapillaryDB-11456.Pedro, da Silva, et al., 199930. m/0.25 mm/0.25 μm, He; Program: 45C => 3C/min => 170C => 15C/min => 300C(10min)
CapillaryCP Sil 5 CB1453.Weyerstahl, Marschall, et al., 1999, 2He; Column length: 25. m; Column diameter: 0.39 mm; Program: not specified
CapillaryDB-11456.Baratta, Dorman, et al., 199830. m/0.25 mm/0.25 μm, He; Program: 45C => 3C/min => 175C => 15C/min => 240C (10min)
CapillaryCP Sil 5 CB1482.Phan, Van, et al., 1998N2; Column length: 25. m; Program: not specified
CapillaryCP Sil 5 CB1445.Weyerstahl, Marschall, et al., 1998N2; Column length: 25. m; Phase thickness: 0.39 μm; Program: not specified
CapillaryDB-11456.Figueiredo, Barroso, et al., 199730. m/0.25 mm/0.25 μm, H2; Program: 45C => 3C/min => 175C => 15C/min => 240C(10min)
CapillaryCP Sil 5 CB1446.Weyerstahl, Marschall, et al., 1997N2; Column length: 25. m; Program: not specified
CapillaryMethyl Silicone1482.Zenkevich, 1996Program: not specified
CapillaryDB-51453.Storer, Elmore, et al., 199330. m/0.32 mm/1. μm; Program: 0C(5min) => 60C/min => 60C (5min) => 4C/min => 250C (5min)
CapillaryDB-51455.Storer, Elmore, et al., 199330. m/0.32 mm/1. μm; Program: 0C(5min) => 60C/min => 60C (5min) => 4C/min => 250C (5min)
CapillaryDB-51456.Storer, Elmore, et al., 199330. m/0.32 mm/1. μm; Program: 0C(5min) => 60C/min => 60C (5min) => 4C/min => 250C (5min)

Normal alkane RI, polar column, temperature ramp

View large format table.

Column type Active phase I Reference Comment
CapillaryDB-FFAP1685.Osorio, Carriazo, et al., 201130. m/0.32 mm/0.25 μm, Helium, 50. C @ 4. min, 4. K/min, 250. C @ 5. min
CapillaryDB-Wax1660.Karlsson, Birgersson, et al., 200930. m/0.25 mm/0.25 μm, Hydrogen, 30. C @ 5. min, 8. K/min, 230. C @ 10. min
CapillaryDB-Wax1672.Guo, Wu, et al., 200830. m/0.25 mm/0.25 μm, Helium, 60. C @ 2. min, 10. K/min, 250. C @ 10. min
CapillaryHP Innowax1659.Capetanos, Saroglou, et al., 200730. m/0.32 mm/0.50 μm, Helium, 3. K/min; Tstart: 60. C; Tend: 260. C
CapillaryCarbowax1650.Ferhat, Meklati, et al., 200760. m/0.2 mm/0.25 μm, He, 60. C @ 8. min, 2. K/min, 250. C @ 15. min
CapillaryCarbowax1640.Ferhat, Tigrine-Kordjani, et al., 200760. m/0.2 mm/0.25 μm, He, 60. C @ 8. min, 2. K/min, 250. C @ 15. min
CapillaryHP-Innowax1673.Formisano, Rigano, et al., 200730. m/0.25 mm/0.25 μm, Helium, 40. C @ 5. min, 2. K/min; Tend: 250. C
CapillaryHP-Innowax1663.Hachicha, Skanji, et al., 200730. m/0.25 mm/0.25 μm, He, 2. K/min, 240. C @ 20. min; Tstart: 60. C
CapillaryTC-FFAP1672.Kurose, Okamura, et al., 2007He, 3. K/min, 220. C @ 30. min; Column diameter: 0.25 mm; Phase thickness: 0.25 μm; Tstart: 60. C
CapillaryTC-Wax1669.Miyazawa and Tamura, 200760. m/0.25 mm/0.25 μm, He, 2. K/min; Tstart: 60. C; Tend: 240. C
CapillaryCP-Wax 52CB1669.Povolo, Contarini, et al., 200760. m/0.32 mm/0.5 μm, He, 40. C @ 8. min, 4. K/min, 220. C @ 20. min
CapillaryDB-Wax1674.Choi, 200660. m/0.25 mm/0.25 μm, N2, 70. C @ 2. min, 2. K/min, 230. C @ 20. min
CapillaryBP-201661.Fanciullino, Tomi, et al., 200650. m/0.22 mm/0.25 μm, He, 2. K/min, 220. C @ 20. min; Tstart: 60. C
CapillarySupelcowax-101679.Garneau F.X., Collin G., et al., 200630. m/0.25 mm/0.25 μm, 40. C @ 2. min, 2. K/min, 210. C @ 33. min
CapillaryBP-201663.Lesueur, Ban, et al., 200650. m/0.22 mm/0.25 μm, He, 2. K/min, 220. C @ 20. min; Tstart: 60. C
CapillaryHP-20M1715.Mastelic, Jerkovic, et al., 200650. m/0.2 mm/0.2 μm, He, 70. C @ 4. min, 4. K/min, 180. C @ 15. min
CapillarySupelcowax-101658.Wong, Lim, et al., 200630. m/0.25 mm/0.25 μm, He, 50. C @ 1. min, 4. K/min, 220. C @ 10. min
CapillaryHP-Innowax1658.Bertes, Freije, et al., 200530. m/0.25 mm/0.25 μm, Helium, 80. C @ 2. min, 5. K/min, 260. C @ 10. min
CapillaryStabilwax1666.Jirovetz, Buchbauer, et al., 200530. m/0.32 mm/0.5 μm, H2, 40. C @ 5. min, 6. K/min, 280. C @ 5. min
CapillaryStabilwax1666.Jirovetz, Buchbauer, et al., 2005, 230. m/0.32 mm/0.5 μm, 40. C @ 5. min, 6. K/min, 280. C @ 5. min
CapillaryCP-Wax1660.Ka, Choi, et al., 200530. m/0.32 mm/0.25 μm, He, 40. C @ 2. min, 5. K/min; Tend: 180. C
CapillaryCP-Wax 52CB1667.Rohloff and Bones, 200530. m/0.32 mm/0.25 μm, He, 40. C @ 1. min, 4. K/min; Tend: 220. C
CapillaryCP-Wax 52CB1667.Rohloff and Bones, 200530. m/0.32 mm/0.25 μm, He, 40. C @ 1. min, 4. K/min; Tend: 220. C
CapillaryCarbowax1663.Szafranek, Chrapkowska, et al., 200530. m/0.25 mm/0.25 μm, 4. K/min; Tstart: 40. C; Tend: 200. C
CapillarySupelcowax-101663.Wong, Lee, et al., 200530. m/0.25 mm/0.25 μm, He, 50. C @ 3. min, 4. K/min, 220. C @ 30. min
CapillaryDB-Wax1673.Choi, 200460. m/0.25 mm/0.25 μm, N2, 70. C @ 2. min, 2. K/min, 230. C @ 20. min
CapillarySupelcowax-101630.Gauvin, Ravaomanarivo, et al., 200460. m/0.2 mm/0.2 μm, He, 4. K/min, 200. C @ 40. min; Tstart: 60. C
CapillarySupelcowax-101672.González, Guerra, et al., 200430. m/0.25 mm/0.25 μm, N2, 2. K/min; Tstart: 40. C; Tend: 230. C
CapillaryInnowax FSC1695.Lourens, Reddy, et al., 2004Helium, 60. C @ 10. min, 4. K/min; Column length: 60. m; Column diameter: 0.25 mm; Tend: 220. C
CapillarySupelcowax-101662.Orav, Stulova, et al., 200450. m/0.2 mm/0.25 μm, He, 2. K/min; Tstart: 70. C; Tend: 230. C
CapillarySupelcowax-101661.Orav, Stulova, et al., 200450. m/0.2 mm/0.25 μm, He, 2. K/min; Tstart: 70. C; Tend: 230. C
CapillarySW-101662.Raal, Paaver, et al., 200450. m/0.20 mm/0.25 μm, He, 2. K/min; Tstart: 50. C; Tend: 230. C
CapillaryHP-Wax1670.Bertoli, Menichini, et al., 200330. m/0.25 mm/0.25 μm, N2, 60. C @ 10. min, 5. K/min; Tend: 220. C
CapillaryHP-20M1638.Mastelic and Jerkovic, 200350. m/0.2 mm/0.2 μm, He, 70. C @ 4. min, 4. K/min, 180. C @ 10. min
CapillaryTC-Wax1636.Miyazawa, Teranishi, et al., 2003He, 3. K/min; Column length: 60. m; Column diameter: 0.25 mm; Tstart: 80. C; Tend: 240. C
CapillaryDB-Wax1664.Mookdasanit, Tamura, et al., 2003Helium, 2. K/min, 210. C @ 60. min; Column length: 60. m; Column diameter: 0.25 mm; Tstart: 70. C
CapillaryCarbowax 20M1684.Priestap, van Baren, et al., 200350. m/0.25 mm/0.25 μm, N2, 3. K/min; Tstart: 90. C; Tend: 220. C
CapillarySW-101662.Raal, Arak, et al., 200350. m/0.20 mm/0.25 μm, He, 2. K/min; Tstart: 50. C; Tend: 250. C
CapillaryInnowax1695.Suleimenov, Atazharova, et al., 2003He, 60. C @ 10. min, 4. K/min, 220. C @ 10. min; Column length: 60. m; Column diameter: 0.25 mm
CapillaryDB-Wax1647.Tu, Onishi, et al., 200360. m/0.25 mm/0.25 μm, N2, 70. C @ 2. min, 2. K/min, 230. C @ 20. min
CapillaryDB-Wax1649.Tu, Onishi, et al., 2003, 260. m/0.25 mm/0.25 μm, N2, 70. C @ 2. min, 2. K/min, 230. C @ 20. min
CapillaryHP-Innowax1670.Velasco-Negueruela, Pérez-Alonso, et al., 2003, 250. m/0.2 mm/0.2 μm, He, 5. K/min; Tstart: 70. C; Tend: 190. C
CapillaryDB-Wax1659.Gancel, Ollé, et al., 200260. m/0.32 mm/0.25 μm, H2, 1.5 K/min, 245. C @ 20. min; Tstart: 40. C
CapillaryCarbowax 20M1668.Kasali, Winterhalter, et al., 200230. m/0.25 mm/0.325 μm, He, 4. K/min, 215. C @ 20. min; Tstart: 50. C
CapillaryPEG-20M1662.Orav, Kailas, et al., 2001He, 2. K/min; Column length: 50. m; Column diameter: 0.2 mm; Tstart: 70. C; Tend: 250. C
CapillaryDB-Wax1662.Buttery, Light, et al., 200060. m/0.25 mm/0.25 μm, 30. C @ 4. min, 2. K/min, 170. C @ 30. min
CapillaryInnowax1671.Kaya, Baser, et al., 199960. m/0.25 mm/0.25 μm, He, 60. C @ 10. min; Tend: 220. C
CapillaryHP-Innowax1671.Kaya, Baser, et al., 1999, 260. m/0.25 mm/0.25 μm, He, 60. C @ 10. min; Tend: 220. C
CapillaryHP-Innowax1671.Kaya, Baser, et al., 1999, 260. m/0.25 mm/0.25 μm, He, 60. C @ 10. min; Tend: 220. C
CapillaryDB-Wax1664.Ngassoum, Yonkeu, et al., 199960. m/0.25 mm/0.25 μm, He, 4. K/min; Tstart: 60. C; Tend: 240. C
CapillaryNB-3511683.Onocha, Ekundayo, et al., 199925. m/0.3 mm/0.5 μm, H2, 70. C @ 2. min, 5. K/min; Tend: 250. C
CapillaryDB-Wax1672.Weyerstahl, Marschall, et al., 1999N2, 5. K/min; Column length: 60. m; Phase thickness: 0.25 μm; Tstart: 60. C; Tend: 220. C
CapillaryDB-Wax1666.Werkhoff, Güntert, et al., 199860. m/0.32 mm/0.25 μm, H2, 3. K/min; Tstart: 60. C; Tend: 220. C
CapillaryCarbowax 20M1662.Kollmannsberger, Nitz, et al., 199245. m/0.32 mm/1.0 μm, Hydrogen, 60. C @ 5. min, 2. K/min; Tend: 200. C
CapillaryDB-Wax1660.Binder, Benson, et al., 19904. K/min, 230. C @ 10. min; Column length: 60. m; Column diameter: 0.32 mm; Tstart: 50. C
CapillaryDB-Wax1660.Binder, Turner, et al., 19904. K/min, 230. C @ 10. min; Column length: 60. m; Column diameter: 0.32 mm; Tstart: 50. C
CapillaryDB-Wax1660.Binder, Turner, et al., 1990, 24. K/min, 230. C @ 10. min; Column length: 60. m; Column diameter: 0.32 mm; Tstart: 50. C
CapillarySupelcowax-101663.Loughrin, Hamilton-Kemp, et al., 1990He, 60. C @ 1. min, 2. K/min; Column length: 60. m; Column diameter: 0.32 mm; Tend: 220. C
CapillarySupelcowax-101681.Andersen, Hamilton-Kemp, et al., 1988He, 60. C @ 1. min, 2. K/min, 220. C @ 30. min; Column length: 60. m; Column diameter: 0.32 mm
CapillarySupelcowax-101668.Ramaswami, Briscese, et al., 198850. C @ 2. min, 4. K/min, 240. C @ 10. min; Column length: 30. m
CapillaryCarbowax 20M1650.Buttery, Maddox, et al., 1986He, 60. C @ 40. min, 1. K/min; Column length: 150. m; Column diameter: 0.66 mm; Tend: 170. C
CapillarySupelcowax-101668.Ramaswami, Briscese, et al., 1986He, 50. C @ 2. min, 4. K/min, 240. C @ 10. min; Column length: 30. m
CapillaryCarbowax 20M1650.Buttery, Xu, et al., 198560. C @ 40. min, 1. K/min; Column length: 150. m; Column diameter: 0.66 mm; Tend: 170. C
CapillaryCarbowax 20M1650.Buttery, Kamm, et al., 19841. K/min, 170. C @ 30. min; Column length: 150. m; Column diameter: 0.64 mm; Tstart: 50. C
CapillaryCarbowax 20M1650.Buttery and Ling, 198460. C @ 40. min, 1. K/min; Column length: 150. m; Column diameter: 0.66 mm; Tend: 170. C

Normal alkane RI, polar column, custom temperature program

View large format table.

Column type Active phase I Reference Comment
CapillaryHP-Innowax1658.Sun, Hua, et al., 201030. m/0.32 mm/0.50 μm, Helium; Program: 50 0C (5 min) 3 0C/min -> 210 0C (10 min) 3 0C/min -> 230 0C
CapillaryHP-20M1628.Zellner, Amorim, et al., 200925. m/0.20 mm/0.20 μm, Helium; Program: 30 0C (1 min) 50 0C/min -> 110 0C 1.5 0C/min -> 145 0C 4 0C/min -> 220 0C (10 min)
CapillaryHP-Innowax1673.Formisano, Mignola, et al., 200750. m/0.2 mm/0.2 μm, He; Program: 40C(5min) => 2C/min => 250C(15min) => 10C/min => 270C
CapillaryAquaWax1664.Liolios, Laouer, et al., 2007Program: not specified
CapillaryInnowax FSC1695.Baser K.H.C., Ozek G., et al., 200660. m/0.25 mm/0.25 μm, He; Program: 60C(10min) => 4C/min => 220C (10min) => 1C/min => 240C
CapillarySupelcowax-101672.Vichi, Guadayol, et al., 200630. m/0.25 mm/0.25 μm, He; Program: 40C(3min) => 4C/min => 75C => 8C/min => 260C(5min)
CapillaryHP-Innowax FSC1695.Tabanca, Demirci, et al., 200560. m/0.25 mm/0.25 μm, He; Program: 60C(10min) => 4C/min => 220C(10min) => 1C/min => 240C
CapillaryHP-Innowax FSC1695.Viljoen, Subramoney, et al., 200560. m/0.25 mm/0.25 μm, He; Program: 60C(10min) => 4C/min => 220C(10min) => 1C/min => 240C
CapillaryHP-Innowax1673.Senatore, Apostolides Arnold, et al., 200450. m/0.2 mm/0.2 μm; Program: not specified
CapillaryCarbowax 20M1669.Vinogradov, 2004Program: not specified
CapillaryInnowax FSC1671.Baser, Demirci, et al., 200360. m/0.25 mm/0.25 μm, He; Program: 60C(10min) => 4C/min => 220C (10min) => 1C/min => 240C
CapillaryHP-Innowax1671.Baser, Demirci, et al., 200260. m/0.25 mm/0.25 μm, He; Program: 60 0C (10 min) 4 K/min -> 220 0C (10 min) 1 K/min -> 240 0C
CapillaryHP-Innowax1671.Gören, Demirci, et al., 200160. m/0.25 mm/0.25 μm, He; Program: 60 0C (10 min) 4 K/min -> 220 0C (10 min) 1 K/min -> 240 0C
CapillaryInnowax FSC1671.Tabanca N., Demirci F., et al., 200160. m/0.25 mm/0.25 μm, He; Program: 60C(10min) => 4C/min => 220C(10min) => 1C/min => 240C
CapillaryHP-Innowax FSC1671.Tabanca, Kirimer, et al., 200160. m/0.25 mm/0.25 μm; Program: 60C(10min) => 4C/min => 220C(10min) => 1C/min => 240C
CapillaryFFAP1662.Tucker, Maciarello, et al., 200150. m/0.2 mm/0.33 μm; Program: 60C(1min) => 2.5C/min => 115C => 1C/min => 210C(30min)
CapillaryHP-Wax1685.Usubillaga, Aparicio, et al., 200160. m/0.25 mm/0.25 μm, He; Program: 50 0C 3 K/min -> 200 0C 8 K/min -> 280 0C
CapillaryInnowax1672.Baser, Tabanca, et al., 200060. m/0.25 mm/0.25 μm, He; Program: 60 0C (10 min) 4 K/min -> 220 0C (10 min) 1 K/min -> 240 0C
CapillaryInnowax FSC1671.Kirimer, Tabanca, et al., 200060. m/0.25 mm/0.25 μm, He; Program: 60C(10 min) => 4C/min => 220C(10min) => 1C/min => 240C
CapillaryHP-Innowax FSC1671.Bagci, Baser, et al., 199960. m/0.25 mm/0.25 μm, He; Program: 60C(10min) => 4C/min => 220C(10min) => 1C/min => 240C
CapillaryHP-Innowax1658.Bouwmeester, Wallaart, et al., 199930. m/0.25 mm/0.25 μm, He; Program: not specified
CapillaryCarbowax 20M1674.Vernin, Lageot, et al., 1998Program: not specified
CapillaryDB-Wax1669.Weyerstahl, Marschall, et al., 1998N2; Column length: 60. m; Phase thickness: 0.25 μm; Program: not specified

References

Khan, Verma, et al., 2006
Khan, M.; Verma, S.C.; Srivastava, S.K.; Shawl, A.S.; Syamsundar, K.V.; Khanuja, S.P.S.; Kumar, T., Essential oil composition of Taxus wallichiana Zucc. from the Northern Himalayan region of India, Flavour Fragr. J., 2006, 21, 5, 772-775, https://doi.org/10.1002/ffj.1682 . [all data]

Khan, Srivastava, et al., 2003
Khan, M.; Srivastava, S.K.; Jain, N.; Syamasundar, K.V.; Yadav, A.K., Chemical composition of fruit and stem essential oils of Lantana camara from northern India, Flavour Fragr. J., 2003, 18, 5, 376-379, https://doi.org/10.1002/ffj.1197 . [all data]

El-Shazly, Dorai, et al., 2002
El-Shazly, A.; Dorai, G.; Wink, M., Chemical composition and biological activity of the essential oils of Senecio aegyptus var. discoideus Boiss., Z. Naturforsch., 2002, 57c, 434-439. [all data]

Khan, Srivastava, et al., 2002
Khan, M.; Srivastava, S.K.; Syamasundar, K.V.; Singh, M.; Naqvi, A.A., Chemical composition of leaf and flower essential oil of Lantana camara from India, Flavour Fragr. J., 2002, 17, 1, 75-77, https://doi.org/10.1002/ffj.1047 . [all data]

Adams, 1998
Adams, R.P., The essential oils and chemotaxonomy of Juniperus sect. Juniperus, Biochem. Syst. Ecol., 1998, 26, 6, 637-645, https://doi.org/10.1016/S0305-1978(98)00020-9 . [all data]

Machado, Militao, et al., 1995
Machado, S.M.F.; Militao, J.S.L.T.; Facundo, V.A.; Ribeiro, A.; de Morais, S.M.; de Alencar, J.W.; Filho, R.B., Essential Oil of Conyza sumatrensis (Retz) Walk, J. Essent. Oil Res., 1995, 7, 1, 83-84, https://doi.org/10.1080/10412905.1995.9698470 . [all data]

Malingré and Maarse, 1974
Malingré, T.M.; Maarse, H., Composition of the essential oil of Mentha aquatica, Phytochemistry, 1974, 13, 8, 1531-1535, https://doi.org/10.1016/0031-9422(74)80322-5 . [all data]