Thiophene, 2-hexyl-

Phase change data

Data compiled by: William E. Acree, Jr., James S. Chickos

Quantity Value Units Method Reference Comment
Δvap56.4 ± 1.3kJ/molCRibeiro da Silva and Santos, 2007

References

Ribeiro da Silva and Santos, 2007
Ribeiro da Silva, M.A.V.; Santos, Ana Filipa L.O.M., Thermochemical study of 2- and 3-alkyl substituted thiophenes, J Therm Anal Calorim, 2007, 88, 1, 7-17, https://doi.org/10.1007/s10973-006-8326-3 . [all data]