Dibenzo[fg,ij]phenanthro[2,1,10,9,8,7-pqrstuv]pentaphene

Gas phase ion energetics data

Data compiled by: Sharon G. Lias, Rhoda D. Levin, and Sherif A. Kafafi

Ionization energy determinations

IE (eV) Method Reference Comment
6.82 ± 0.02PEClar and Schmidt, 1978Vertical value
6.82PEClar and Schmidt, 1977Vertical value

References

Clar and Schmidt, 1978
Clar, E.; Schmidt, W., Correlations between photoelectron and ultravioet absorption spectra of polycyclic hydrocarbons. The terrylene and peropyrene series, Tetrahedron, 1978, 34, 3219. [all data]

Clar and Schmidt, 1977
Clar, E.; Schmidt, W., Correlations between photoelectron and ultraviolet absorption spectra of polycyclic hydrocarbons. The perylene, coronene and bisanthene series, Tetrahedron, 1977, 33, 2093. [all data]