3-Hexadecanone

Phase change data

Data compiled by: Robert L. Brown and Stephen E. Stein

Reduced pressure boiling point

Tboil (K) Pressure (bar) Reference
457.20.023Weast and Grasselli, 1989
413.20.003Weast and Grasselli, 1989

Normal alkane RI, non-polar column, temperature ramp

View large format table.

Column type Active phase I Reference Comment
CapillaryDB-11778.Ouattara, Koudou, et al., 200730. m/0.25 mm/0.15 μm, 3. K/min; Tstart: 60. C; Tend: 220. C
CapillaryCross-Linked Methylsilicone1777.Bravo and Hotchkiss, 1993He, 35. C @ 3. min, 4. K/min; Column length: 25. m; Column diameter: 0.32 mm; Tend: 225. C

Normal alkane RI, non-polar column, custom temperature program

View large format table.

Column type Active phase I Reference Comment
CapillaryHP-5 MS1803.Schmidt, Noletto, et al., 200630. m/0.25 mm/0.25 μm, Helium; Program: 40 0C (10 min) 3 0C/min -> 200 0C 2 0C/min -> 220 0C

References

Weast and Grasselli, 1989
CRC Handbook of Data on Organic Compounds, 2nd Editon, Weast,R.C and Grasselli, J.G., ed(s)., CRC Press, Inc., Boca Raton, FL, 1989, 1. [all data]

Ouattara, Koudou, et al., 2007
Ouattara, L.; Koudou, J.; Obame, L.C.E.; Karou, D.S.; Traore, A.; Bessiere, J.M., Chemical composition and antibacterial activity of Cochlospermum planchoni Hook. f. ex Planch essential oil from Burkina Faso, Pakistan J. Biol. Sci., 2007, 10, 22, 4177-4179, https://doi.org/10.3923/pjbs.2007.4177.4179 . [all data]

Bravo and Hotchkiss, 1993
Bravo, A.; Hotchkiss, J.H., Identification of volatile compounds resulting from the thermal oxidation of polyethylene, J. Appl. Polym. Sci., 1993, 47, 10, 1741-1748, https://doi.org/10.1002/app.1993.070471004 . [all data]

Schmidt, Noletto, et al., 2006
Schmidt, J.M.; Noletto, J.A.; Vogler, B.; Setzer, W.N., Abaco Bush Medicine: Chemical composition of the essential oils of four aromatic medicinal plants from Abaco Island, Bahamas, J. Herbs, Spices Medicinal Plants, 2006, 12, 3, 43-65, https://doi.org/10.1300/J044v12n03_04 . [all data]