2-Hexadecanone

Normal alkane RI, non-polar column, custom temperature program

Data compiled by: NIST Mass Spectrometry Data Center, William E. Wallace, director

Column type CapillaryCapillaryCapillaryCapillaryCapillary
Active phase BPX-5BPX-5HP-1Polydimethyl siloxaneBPX-5
Column length (m) 30.30.25. 50.
Carrier gas HeliumHelium  Helium
Substrate
Column diameter (mm) 0.250.250.32 0.32
Phase thickness (μm) 0.250.250.17 0.50
Program 35 0C (5 min) 3 0C/min -> 210 0C 40 0C/min -> 240 0C (10 min)not specifiednot specifiednot specified40 0C (5 min) 20 0C/min -> 60 0C (5 min) 4 0C/min -> 250 0C (10 min)
I 1809.1805.1782.1770.1808.
Referencese Souza, Cardeal, et al., 2009se Souza, Cardeal, et al., 2009Wetwiayaklung, Thavanapong, et al., 2009Junkes, Castanho, et al., 2003Madruga, Arruda, et al., 2000
Comment MSDC-RI MSDC-RI MSDC-RI MSDC-RI MSDC-RI
Column type CapillaryCapillaryCapillaryCapillary
Active phase SE-54DB-1DB-1SE-54
Column length (m) 50.60.60.50.
Carrier gas He
Substrate
Column diameter (mm) 0.320.250.250.32
Phase thickness (μm)  0.250.25
Program 35 0C (5 min) 8 0C/min -> 200 0C 2 0C/min -> 250 0Cnot specifiednot specified35C(5min) => 8C/min => 200C => 2C/min => 250C
I 1807.1778.1783.1804.
ReferenceUm, Bailey, et al., 1992Kawai, Ishida, et al., 1991Kawai, Ishida, et al., 1991Suzuki and Bailey, 1985
Comment MSDC-RI MSDC-RI MSDC-RI MSDC-RI

Normal alkane RI, non-polar column, temperature ramp

Data compiled by: NIST Mass Spectrometry Data Center, William E. Wallace, director

Column type CapillaryCapillaryCapillaryCapillary
Active phase HP-1HP-1Cross-Linked MethylsiliconeOV-101
Column length (m) 25.50.25.54.
Carrier gas  HeHeHelium
Substrate
Column diameter (mm) 0.320.20.320.26
Phase thickness (μm) 0.170.5
Tstart (C) 50.60.35.50.
Tend (C) 260.220.225.240.
Heat rate (K/min) 1.2.4.5.
Initial hold (min) 5. 3.0.
Final hold (min) 5.40. 0.
I 1785.1778.1781.1791.
ReferenceWetwiayaklung, Thavanapong, et al., 2009Valette, Fernandez, et al., 2003Bravo and Hotchkiss, 1993Zenkevich and Ventura, 1991
Comment MSDC-RI MSDC-RI MSDC-RI MSDC-RI

Normal alkane RI, non-polar column, isothermal

Data compiled by: NIST Mass Spectrometry Data Center, William E. Wallace, director

Column type Capillary
Active phase OV-1
Column length (m)
Carrier gas
Substrate
Column diameter (mm)
Phase thickness (μm)
Temperature (C) 60.
I 1770.
ReferenceAmboni, Junkes, et al., 2002
Comment MSDC-RI

References

se Souza, Cardeal, et al., 2009
se Souza, P.P.; Cardeal, Z.DeL.; Augusti, R.; Morrison, P.; Marriott, P.J., Determination of volatile compounds in Brazilian distilled cachaca by using comprehensive two-dimensional gas chromatography and effects of production pathways, J. Chromatogr. A., 2009, 1216, 14, 2881-2890, https://doi.org/10.1016/j.chroma.2008.10.061 . [all data]

Wetwiayaklung, Thavanapong, et al., 2009
Wetwiayaklung, P.; Thavanapong, N.; Charoenteeraboon, J., Chemical constituents and antimicrobial activity os essential oil and extracts of heartwood of Aquilaria crassna obtained from water distillation and supercritical fluid carbon dioxide extraction, Silpakorn U Sci. J., 2009, 3, 1, 25-33. [all data]

Junkes, Castanho, et al., 2003
Junkes, B.S.; Castanho, R.D.M.; Amboni, C.; Yunes, R.A.; Heinzen, V.E.F., Semiempirical Topological Index: A Novel Molecular Descriptor for Quantitative Structure-Retention Relationship Studies, Internet Electronic Journal of Molecular Design, 2003, 2, 1, 33-49. [all data]

Madruga, Arruda, et al., 2000
Madruga, M.S.; Arruda, S.G.B.; Narain, N.; Souza, J.G., Castration and slaughter age effects on panel assessment and aroma compounds of the mestico goat meat, Meat Sci., 2000, 56, 2, 117-125, https://doi.org/10.1016/S0309-1740(00)00025-5 . [all data]

Um, Bailey, et al., 1992
Um, K.W.; Bailey, M.E.; Clarke, A.D.; Chao, R.R., Concentration and identification of volatile compounds from heated beef fat using supercritical CO2 extraction-gas liquid chromatography/mass spectrometry, J. Agric. Food Chem., 1992, 40, 9, 1641-1646, https://doi.org/10.1021/jf00021a033 . [all data]

Kawai, Ishida, et al., 1991
Kawai, T.; Ishida, Y.; Kakiuchi, H.; Ikeda, N.; Higashida, T.; Nakamura, S., Flavor components of dried squid, J. Agric. Food Chem., 1991, 39, 4, 770-777, https://doi.org/10.1021/jf00004a031 . [all data]

Suzuki and Bailey, 1985
Suzuki, J.; Bailey, M.E., Direct sampling capillary GLC analysis of flavor volatiles from ovine fat, J. Agric. Food Chem., 1985, 33, 3, 343-347, https://doi.org/10.1021/jf00063a006 . [all data]