Benzofurazan, 4-nitro-, 1-oxide

Gas phase thermochemistry data

Data compiled by: Hussein Y. Afeefy, Joel F. Liebman, and Stephen E. Stein

Quantity Value Units Method Reference Comment
Δfgas299.9 ± 2.6kJ/molCcbAcree, Bott, et al., 1996

Condensed phase thermochemistry data

Data compiled by: Hussein Y. Afeefy, Joel F. Liebman, and Stephen E. Stein

Quantity Value Units Method Reference Comment
Δfsolid202.6 ± 2.1kJ/molCcbAcree, Bott, et al., 1996
Quantity Value Units Method Reference Comment
Δcsolid-2992.4 ± 1.9kJ/molCcbAcree, Bott, et al., 1996

Phase change data

Data compiled as indicated in comments:
ALS - Hussein Y. Afeefy, Joel F. Liebman, and Stephen E. Stein
AC - William E. Acree, Jr., James S. Chickos

Quantity Value Units Method Reference Comment
Δsub97.3 ± 1.6kJ/molCAcree, Bott, et al., 1996ALS
Δsub97.3 ± 1.6kJ/molCAcree, Bott, et al., 1996AC

References

Acree, Bott, et al., 1996
Acree, W.E., Jr.; Bott, S.G.; Tucker, S.A.; Ribeiro da Silva, M.D.M.C.; Matos, M.A.R.; Pilcher, G., Enthalpies of combustion of 5-methoxybenzofurazan, 5-methoxybenzfurazan-1-oxide, 5-methylbenzofurazan-1-oxide, 5-chlorobenzofurazan-1-oxide, and 4-nitro-benzofurazan-1-oxide: the dissociation enthalpies of the N-O bonds, J. Chem. Thermodyn., 1996, 28, 673-683. [all data]