Cycloundecasiloxane, docosamethyl

Phase change data

Data compiled as indicated in comments:
TRC - Thermodynamics Research Center, NIST Boulder Laboratories, Chris Muzny director
AC - William E. Acree, Jr., James S. Chickos

Quantity Value Units Method Reference Comment
Tfus220.KN/AAlvik and Dale, 1971Uncertainty assigned by TRC = 1. K; TRC

Enthalpy of vaporization

ΔvapH (kcal/mol) Temperature (K) Method Reference Comment
17.8511.AStephenson and Malanowski, 1987Based on data from 496. - 620. K.; AC

Enthalpy of fusion

ΔfusH (kcal/mol) Temperature (K) Reference Comment
4.238216.2Alvik, Dale, et al., 1971AC

In addition to the Thermodynamics Research Center (TRC) data available from this site, much more physical and chemical property data is available from the following TRC products:

Normal alkane RI, non-polar column, temperature ramp

View large format table.

Column type Active phase I Reference Comment
CapillaryMethyl Silicone2185.Fujimoto, Ohtani, et al., 199025. m/0.25 mm/0.1 μm, He, 5. K/min; Tstart: 40. C; Tend: 350. C

References

Alvik and Dale, 1971
Alvik, T.; Dale, J., On the Lack of Conformational Preferences for Cyclic Dimethylsiloxane Oligomers., Acta Chem. Scand., 1971, 25, 2131, https://doi.org/10.3891/acta.chem.scand.25-2131 . [all data]

Stephenson and Malanowski, 1987
Stephenson, Richard M.; Malanowski, Stanislaw, Handbook of the Thermodynamics of Organic Compounds, 1987, https://doi.org/10.1007/978-94-009-3173-2 . [all data]

Alvik, Dale, et al., 1971
Alvik, Thor; Dale, Johannes; Fernholt, L.; Hedberg, Kenneth; Schaumburg, Kjeld; Ehrenberg, L., On the Lack of Conformational Preferences for Cyclic Dimethylsiloxane Oligomers., Acta Chem. Scand., 1971, 25, 2131-2141, https://doi.org/10.3891/acta.chem.scand.25-2131 . [all data]

Fujimoto, Ohtani, et al., 1990
Fujimoto, S.; Ohtani, H.; Yamagiwa, K.; Tsuge, S., Study on retention behavior of cyclic siloxanes by high resolution pyrolysis-gas chromatography with a fused silica capillary column, J. Hi. Res. Chromatogr., 1990, 13, 6, 397-404, https://doi.org/10.1002/jhrc.1240130603 . [all data]