Tetracyclo[3.3.1.02,4.06,8]nonane

Condensed phase thermochemistry data

Data compiled by: Hussein Y. Afeefy, Joel F. Liebman, and Stephen E. Stein

Quantity Value Units Method Reference Comment
Δcliquid-1290.55kcal/molCcbWineman, 1963Heat of combustion was corrected for net Hc; Corresponding Δfliquid = 34.20 kcal/mol (simple calculation by NIST; no Washburn corrections)

References

Wineman, 1963
Wineman, R.J., Tetracyclo-[3.3.1.0.2,4068]-nonane as a new compound and use as a high energery fuel, Pattent No. 3,113,424 to Monsanto Research Corp., Everett, MA USA 12/10/63, 1963, 1. [all data]