1-Octadecanol, TMS derivative

Kovats' RI, non-polar column, isothermal

View large format table.

Column type Active phase Temperature (C) I Reference Comment
PackedSE-30140.2128.Zarazir, Chovin, et al., 1970Chromosorb W; Column length: 2. m

Kovats' RI, polar column, isothermal

View large format table.

Column type Active phase Temperature (C) I Reference Comment
PackedCarbowax 20M140.2135.Zarazir, Chovin, et al., 1970Chromosorb W; Column length: 2. m

Van Den Dool and Kratz RI, non-polar column, temperature ramp

View large format table.

Column type Active phase I Reference Comment
CapillaryOV-52178.García, Sáenz, et al., 199725. m/0.25 mm/0.23 μm, He, 230. C @ 6. min, 4. K/min; Tend: 300. C
CapillaryDB-12159.Peng, 199215. m/0.53 mm/1. μm, 40. C @ 4. min, 8. K/min; Tend: 250. C
CapillaryOV-12160.Harvey, 198950. m/0.30 mm/0.52 μm, He, 2. K/min; Tstart: 130. C; Tend: 280. C

Van Den Dool and Kratz RI, non-polar column, custom temperature program

View large format table.

Column type Active phase I Reference Comment
CapillaryVF-5MS2149.1Zheng and White, 200830. m/0.25 mm/0.25 μm, He; Program: not specified
CapillaryVF-5MS2145.3Tret'yakov, 200730. m/0.25 mm/0.25 μm, He; Program: Multi-step temperature program; T(initial)=60C; T(final)=270C
CapillaryMethyl Silicone2159.Peng, Yang, et al., 1991Program: not specified

Van Den Dool and Kratz RI, polar column, temperature ramp

View large format table.

Column type Active phase I Reference Comment
CapillaryCarbowax 20M2144.Peng, 19928. K/min, 200. C @ 60. min; Column length: 3.05 m; Tstart: 40. C
PackedCarbowax 20M2144.Peng, Yang, et al., 1991Supelcoport, 40. C @ 4. min, 8. K/min; Column length: 3.05 m; Tend: 200. C

Normal alkane RI, non-polar column, temperature ramp

View large format table.

Column type Active phase I Reference Comment
CapillaryRTX-5 Sil MS2154.Lytovchenko, Beleggia, et al., 200930. m/0.25 mm/0.25 μm, Helium, 70. C @ 5. min, 5. K/min, 310. C @ 1. min
CapillaryHP-52165.Isidorov, Lech, et al., 200830. m/0.25 mm/0.25 μm, Helium, 3. K/min, 300. C @ 30. min; Tstart: 50. C

Normal alkane RI, non-polar column, custom temperature program

View large format table.

Column type Active phase I Reference Comment
CapillarySE-302165.Poole and Zlatkis, 1979Program: not specified

References

Zarazir, Chovin, et al., 1970
Zarazir, D.; Chovin, P.; Guiochon, G., Identification of hydroxylic compounds and their derivatives by gas chromatography, Chromatographia, 1970, 3, 4, 180-195, https://doi.org/10.1007/BF02269018 . [all data]

García, Sáenz, et al., 1997
García, M.D.; Sáenz, M.T.; Ahumada, M.D.; Cert, A., Isolation of three triterpenes and several aliphatic alcohols from Crataegus monogyna Jacq., J. Chromatogr. A, 1997, 767, 1-2, 340-342, https://doi.org/10.1016/S0021-9673(96)01091-6 . [all data]

Peng, 1992
Peng, C.T., A method for tentative identificatoin of unknown gas chromatographic peaks by retention index, J. Radioanal. Nucl. Chem., 1992, 160, 2, 449-460, https://doi.org/10.1007/BF02037120 . [all data]

Harvey, 1989
Harvey, D.J., Identification of long-chain fatty acids and alcohols from human cerumen by the use of picolinyl and nicotinate esters, Biomed. Environ. Mass Spectrom., 1989, 18, 9, 719-723, https://doi.org/10.1002/bms.1200180912 . [all data]

Zheng and White, 2008
Zheng, Y.; White, E., Retention Data. NIST Mass Spectrometry Data Center., NIST Mass Spectrometry Data Center, 2008. [all data]

Tret'yakov, 2007
Tret'yakov, K.V., Retention Data. NIST Mass Spectrometry Data Center., NIST Mass Spectrometry Data Center, 2007. [all data]

Peng, Yang, et al., 1991
Peng, C.T.; Yang, Z.C.; Maltby, D., Prediction of retention indexes. III. Silylated derivatives of polar compounds, J. Chromatogr., 1991, 586, 1, 113-129, https://doi.org/10.1016/0021-9673(91)80029-G . [all data]

Lytovchenko, Beleggia, et al., 2009
Lytovchenko, A.; Beleggia, R.; Schauer, N.; Isaacson, T.; Leuendorf, J.E.; Hellmann, H.; Rose, J.K.C.; Fernie, A.R., Application of GC-MS fpr the detection of lipophilic compounds in diverse plant tissues, Plant Methods, 2009, 5, 4, 1-11. [all data]

Isidorov, Lech, et al., 2008
Isidorov, V.A.; Lech, P.; Zolciak, A.; Rusak, N.; Szczepaniak, L., Gas Chromatographic - nass spectrometric investigation of metabolites from the needles and roots of pine seedlings at early stages of pathogenic fungi Armillaria ostoyae attack, Trees, 2008, 22, 4, 531-542, https://doi.org/10.1007/s00468-008-0213-z . [all data]

Poole and Zlatkis, 1979
Poole, C.F.; Zlatkis, A., Trialkylsilyl Ether Derivatives (Other Than TMS) for Gas Chromatography and Mass Spectrometry, J. Chromatogr. Sci., 1979, 17, 3, 115-123, https://doi.org/10.1093/chromsci/17.3.115 . [all data]