Tricyclo[4.1.0.02,4]-heptane

Gas phase thermochemistry data

Data compiled by: Hussein Y. Afeefy, Joel F. Liebman, and Stephen E. Stein

Quantity Value Units Method Reference Comment
Δfgas35.62 ± 0.37kcal/molCcbPimenova, Fogel, et al., 1974

Condensed phase thermochemistry data

Data compiled by: Hussein Y. Afeefy, Joel F. Liebman, and Stephen E. Stein

Quantity Value Units Method Reference Comment
Δfliquid26.94 ± 0.35kcal/molCcbPimenova, Fogel, et al., 1974
Quantity Value Units Method Reference Comment
Δcliquid-1026.88 ± 0.34kcal/molCcbPimenova, Fogel, et al., 1974Corresponding Δfliquid = 26.95 kcal/mol (simple calculation by NIST; no Washburn corrections)

Phase change data

Data compiled as indicated in comments:
ALS - Hussein Y. Afeefy, Joel F. Liebman, and Stephen E. Stein
DRB - Donald R. Burgess, Jr.
AC - William E. Acree, Jr., James S. Chickos

Quantity Value Units Method Reference Comment
Δvap8.72 ± 0.13kcal/molVPimenova, Fogel, et al., 1974ALS
Δvap8.68kcal/molN/APimenova, Fogel, et al., 1974DRB
Δvap8.7 ± 0.1kcal/molEBVarushchenko, Druzhimina, et al., 1974AC

References

Pimenova, Fogel, et al., 1974
Pimenova, S.M.; Fogel, L.; Kozina, M.P.; Galchenko, G.L., Heat of combustion of tricyclo[4.1.0.0(2,4)]heptane, J. Gen. Chem. USSR, 1974, 44, 1357-1358. [all data]

Varushchenko, Druzhimina, et al., 1974
Varushchenko, R.M.; Druzhimina, A.I.; Kovner, O.Y.; Mil'vitskaya, E.M.; Bobyleva, A.A.; Belikova, N.A.; Gal'chenko, G.L., Russ. J. Phys. Chem., 1974, 48, 1121. [all data]