Propane, 1-bromo-2-fluoro-

Gas phase ion energetics data

Data compiled by: Sharon G. Lias, Rhoda D. Levin, and Sherif A. Kafafi

Ionization energy determinations

IE (eV) Method Reference Comment
10.44PEGounelle, Menard, et al., 1975Vertical value

References

Gounelle, Menard, et al., 1975
Gounelle, Y.; Menard, C.; Pechine, J.M.; Solgadi, D.; Menes, F.; Botter, R., Conformational effects on ionization potentials; Photoelectron spectra of dibromo- and bromofluoro- alkyl compounds, J. Electron Spectrosc. Relat. Phenom., 1975, 7, 247. [all data]