1,2-Dioxin, 3,6-dihydro-

Gas phase thermochemistry data

Data compiled by: Glushko Thermocenter, Russian Academy of Sciences, Moscow

Constant pressure heat capacity of gas

Cp,gas (J/mol*K) Temperature (K) Reference Comment
33.5250.Dorofeeva O.V., 1992p=1 bar.
38.20100.
47.34150.
59.19200.
79.58273.15
86.9 ± 4.0298.15
87.48300.
116.06400.
140.79500.
161.07600.
177.65700.
191.35800.
202.80900.
212.461000.
220.641100.
227.621200.
233.591300.
238.721400.
243.151500.

References

Dorofeeva O.V., 1992
Dorofeeva O.V., Ideal gas thermodynamic properties of oxygen heterocyclic compounds. Part 2. Six-membered, seven-membered and eight-membered rings, Thermochim. Acta, 1992, 200, 121-150. [all data]