Carbonyl fluoride

Gas phase thermochemistry data

Quantity Value Units Method Reference Comment
Δfgas-171.54kJ/molReviewChase, 1998Data last reviewed in December, 1965
Quantity Value Units Method Reference Comment
gas,1 bar248.48J/mol*KReviewChase, 1998Data last reviewed in December, 1965

Gas Phase Heat Capacity (Shomate Equation)

Cp° = A + B*t + C*t2 + D*t3 + E/t2
H° − H°298.15= A*t + B*t2/2 + C*t3/3 + D*t4/4 − E/t + F − H
S° = A*ln(t) + B*t + C*t2/2 + D*t3/3 − E/(2*t2) + G
    Cp = heat capacity (J/mol*K)
    H° = standard enthalpy (kJ/mol)
    S° = standard entropy (J/mol*K)
    t = temperature (K) / 1000.

View plot Requires a JavaScript / HTML 5 canvas capable browser.

View table.

Temperature (K) 298. - 1200.1200. - 6000.
A 25.0353856.72123
B 57.489830.791822
C -40.25673-0.155026
D 10.469040.010465
E 0.004584-4.819299
F -181.2136-200.1111
G 263.3569301.0928
H -171.5440-171.5440
ReferenceChase, 1998Chase, 1998
Comment Data last reviewed in December, 1965 Data last reviewed in December, 1965

References

Chase, 1998
Chase, M.W., Jr., NIST-JANAF Themochemical Tables, Fourth Edition, J. Phys. Chem. Ref. Data, Monograph 9, 1998, 1-1951. [all data]