C5H7O4-2

Reaction thermochemistry data

Data compiled by: John E. Bartmess

Individual Reactions

C5H6O4-2 + Hydrogen cation = C5H7O4-2

By formula: C5H6O4-2 + H+ = C5H7O4-2

Quantity Value Units Method Reference Comment
Δr413.9 ± 3.7kcal/molD-EADing, Wang, et al., 1998gas phase

C5H7O4-2 + Water = C5H9O5-

By formula: C5H7O4-2 + H2O = C5H9O5-

Quantity Value Units Method Reference Comment
Δr5.50 ± 0.30kcal/molTDAsBlades, Klassen, et al., 1995gas phase

References

Ding, Wang, et al., 1998
Ding, C.F.; Wang, X.B.; Wang, L.S., Photoelectron spectroscopy of doubly charged anions: Intramolecular Coulomb repulsion and solvent stabilization, J. Phys. Chem. A, 1998, 102, 45, 8633-8636, https://doi.org/10.1021/jp982698x . [all data]

Blades, Klassen, et al., 1995
Blades, A.T.; Klassen, J.S.; Kebarle, P., Free Energies of Hydration in the Gas Phase on the Anions of Some Oxo Acids of C, N, S, P, Cl and I, J. Am. Chem. Soc., 1995, 117, 42, 10563, https://doi.org/10.1021/ja00147a019 . [all data]