Benzo[g]pteridine-2,4(3H,10H)-dione, 3,7,8,10-tetramethyl-

Gas phase ion energetics data

Data compiled by: Sharon G. Lias, Rhoda D. Levin, and Sherif A. Kafafi

Ionization energy determinations

IE (eV) Method Reference Comment
8.22PEEweg, Muller, et al., 1980Vertical value

References

Eweg, Muller, et al., 1980
Eweg, J.; Muller, F.; van Dam, H.; Terpstra, A.; Oskam, A., He(I) and He(II) photoelectron spectra of alloxazines and isoalloxazines, J. Am. Chem. Soc., 1980, 102, 51. [all data]