Butanoic acid, 4-(2,4-dichlorophenoxy)-, methyl ester

Kovats' RI, polar column, isothermal

Data compiled by: NIST Mass Spectrometry Data Center, William E. Wallace, director

Column type PackedPacked
Active phase FFAPFFAP
Column length (m) 1.81.8
Carrier gas
Substrate
Column diameter (mm)
Phase thickness (μm)
Temperature (C) 165.165.
I 2551.2552.
Referencede Beer, van Peteghem, et al., 1978de Beer, van Peteghem, et al., 1978
Comment MSDC-RI MSDC-RI

Kovats' RI, non-polar column, isothermal

View large format table.

Column type Active phase Temperature (C) I Reference Comment
PackedDC-200165.1799.de Beer, van Peteghem, et al., 1978
PackedDC-200165.1799.de Beer, van Peteghem, et al., 1978

Normal alkane RI, non-polar column, temperature ramp

View large format table.

Column type Active phase I Reference Comment
CapillaryUltra-11794.Okumura, 199125. m/0.32 mm/0.25 μm, He, 3. K/min; Tstart: 80. C; Tend: 260. C

References

de Beer, van Peteghem, et al., 1978
de Beer, J.; van Peteghem, C.; Heyndrickx, A., Comparative Study of the Gas-Liquid Chromatographic Behaviour of the Pentafluorobenzyl Esters and the Methyl Esters of Ten Chlorophenoxyalkyl Acids, J. Chromatogr., 1978, 157, 97-110, https://doi.org/10.1016/S0021-9673(00)92325-2 . [all data]