iron dihydroxide

Vibrational and/or electronic energy levels

Data compiled by: Marilyn E. Jacox

State:   X

Vib.
sym.
 No.   Approximate
 type of mode
 cm-1   Med.   Method   References

b 6 OH a-stretch 3727.9 Ar IR Wang and Andrews, 2006
7 FeO2 a-stretch 737.3 Ar IR Kauffman, Hauge, et al., 1985
Zhang, Zhou, et al., 2001
Wang and Andrews, 2006

Additional references: Jacox, 1994, page 251; Jacox, 2003, page 265

References

Wang and Andrews, 2006
Wang, X.; Andrews, L., Infrared Spectra of M(OH), J. Phys. Chem. A, 2006, 110, 33, 10035, https://doi.org/10.1021/jp0624698 . [all data]

Kauffman, Hauge, et al., 1985
Kauffman, J.W.; Hauge, R.H.; Margrave, J.L., Studies of reactions of atomic and diatomic chromium, manganese, iron, cobalt, nickel, copper, and zinc with molecular water at 15 K, J. Phys. Chem., 1985, 89, 16, 3541, https://doi.org/10.1021/j100262a023 . [all data]

Zhang, Zhou, et al., 2001
Zhang, L.; Zhou, M.; Shao, L.; Wang, W.; Fan, K.; Qin, Q., Reactions of Fe with H, J. Phys. Chem. A, 2001, 105, 29, 6998, https://doi.org/10.1021/jp010914n . [all data]

Jacox, 1994
Jacox, M.E., Vibrational and electronic energy levels of polyatomic transient molecules, American Chemical Society, Washington, DC, 1994, 464. [all data]

Jacox, 2003
Jacox, M.E., Vibrational and electronic energy levels of polyatomic transient molecules: supplement B, J. Phys. Chem. Ref. Data, 2003, 32, 1, 1-441, https://doi.org/10.1063/1.1497629 . [all data]