Myristic acid, TMS derivative

Van Den Dool and Kratz RI, non-polar column, temperature ramp

Data compiled by: NIST Mass Spectrometry Data Center, William E. Wallace, director

Column type CapillaryCapillaryCapillaryCapillaryCapillary
Active phase Ultra-1OV-1OV-1SE-52CP Sil 5 CB
Column length (m) 25.50.10.25.
Carrier gas  HeHeHeN2
Substrate
Column diameter (mm) 0.320.300.220.32
Phase thickness (μm) 0.520.520.170.52
Tstart (C) 35.130.70.70.60.
Tend (C) 320.280.270.270.280.
Heat rate (K/min) 15.2.5.5.6.
Initial hold (min)     0.5
Final hold (min) 10.   5.
I 1842.121844.1848.1850.1844.
ReferenceRichmond and Pombo-Villar, 1997Harvey, 1989Lefevere, Verhaeghe, et al., 1989Lefevere, Verhaeghe, et al., 1989Wurth, Kumps, et al., 1989
Comment MSDC-RI MSDC-RI MSDC-RI MSDC-RI MSDC-RI
Column type CapillaryPacked
Active phase SE-52OV-1
Column length (m) 25.1.8
Carrier gas HeN2
Substrate  100-120 mesh
Column diameter (mm) 0.20
Phase thickness (μm) 0.40
Tstart (C) 50.70.
Tend (C) 270.290.
Heat rate (K/min) 5.28.
Initial hold (min)  0.5
Final hold (min)
I 1850.1845.
ReferenceLefevere, Verhaeghe, et al., 1988Tanaka, Hine, et al., 1980
Comment MSDC-RI MSDC-RI

References

Richmond and Pombo-Villar, 1997
Richmond, R.; Pombo-Villar, E., Short communication. Gas chromatography-mass spectrometry coupled with pseudo-Sadtler retention indices, for the identification of components in the essential oil of Curcuma longa L., J. Chromatogr. A, 1997, 760, 2, 303-308, https://doi.org/10.1016/S0021-9673(96)00802-3 . [all data]

Harvey, 1989
Harvey, D.J., Identification of long-chain fatty acids and alcohols from human cerumen by the use of picolinyl and nicotinate esters, Biomed. Environ. Mass Spectrom., 1989, 18, 9, 719-723, https://doi.org/10.1002/bms.1200180912 . [all data]

Lefevere, Verhaeghe, et al., 1989
Lefevere, M.F.; Verhaeghe, B.J.; Declerck, D.H.; Van Bocxlaer, J.F.; De Leenheer, A.P.; De Sagher, R.M., Metabolic Profiling of Urinary Organic Acids by Single and Multicolumn Capillary Gas Chromatography, J. Chromatogr. Sci., 1989, 27, 1, 23-29, https://doi.org/10.1093/chromsci/27.1.23 . [all data]

Wurth, Kumps, et al., 1989
Wurth, C.; Kumps, A.; Mardens, Y., Urinary organic acids: Retention indices on two capillary gas chromatography columns, J. Chromatogr., 1989, 491, 186-192, https://doi.org/10.1016/S0378-4347(00)82831-5 . [all data]

Lefevere, Verhaeghe, et al., 1988
Lefevere, M.F.; Verhaeghe, B.J.; Declerck, D.M.; de Leenheer, A.P., Automated profiling of urinary organic acids by dual-column gas chromatography and gas chromatography/mass spectrometry, Biomed. Environ. Mass Spectrom., 1988, 15, 6, 311-322, https://doi.org/10.1002/bms.1200150603 . [all data]

Tanaka, Hine, et al., 1980
Tanaka, K.; Hine, D.G.; West-Dull, A.; Lynn, T.B., Gas-chromatographic method of analysis for urinary organic acids. I. Retention indices of 155 metabolically important compounds, Clin. Chem., 1980, 26, 13, 1839-1846. [all data]