Butane, 1-(1-methylethoxy)-

Normal alkane RI, non-polar column, temperature ramp

View large format table.

Column type Active phase I Reference Comment
CapillaryDB-5725.Shimoda, Shibamoto, et al., 199360. m/0.25 mm/0.25 μm, He, 40. C @ 2. min, 3. K/min; Tend: 200. C

Phase change data

Data compiled as indicated in comments:
BS - Robert L. Brown and Stephen E. Stein

Quantity Value Units Method Reference Comment
Tboil382.3KN/AMajer and Svoboda, 1985
Quantity Value Units Method Reference Comment
Δvap9.27kcal/molN/AMajer and Svoboda, 1985

Reduced pressure boiling point

Tboil (K) Pressure (atm) Reference Comment
381.20.971Weast and Grasselli, 1989BS

Enthalpy of vaporization

ΔvapH (kcal/mol) Temperature (K) Reference Comment
7.875382.3Majer and Svoboda, 1985

References

Shimoda, Shibamoto, et al., 1993
Shimoda, M.; Shibamoto, T.; Noble, A.C., Evaluation of heaspace volatiles of Cabernet Sauvignon wines sampled by an on-column method, J. Agric. Food Chem., 1993, 41, 10, 1664-1668, https://doi.org/10.1021/jf00034a028 . [all data]