m-carboranecarboxylic acid

Phase change data

Data compiled by: William E. Acree, Jr., James S. Chickos

Quantity Value Units Method Reference Comment
Δsub97.7 ± 0.7kJ/molN/APilcher and Skinner, 1983See also Gal'chenko, Martynovskaya, et al., 1970.

References

Pilcher and Skinner, 1983
Pilcher, G.; Skinner, H.A., Thermochemistry of organometallic compounds, 1983, 43-90, https://doi.org/10.1002/9780470771686.ch2 . [all data]

Gal'chenko, Martynovskaya, et al., 1970
Gal'chenko, G.L.; Martynovskaya, L.N.; Stanko, V.I.; Klimova, A.I., Dokl. Akad. Nauk SSSR, 1970, 193, 483. [all data]