1,2-cis-dimethylacenaphthene

Phase change data

Data compiled by: William E. Acree, Jr., James S. Chickos

Enthalpy of fusion

ΔfusH (kJ/mol) Temperature (K) Reference
22.59325.2Canceill, Jacques, et al., 1974

References

Canceill, Jacques, et al., 1974
Canceill, J.; Jacques, J.; Perucaud-Brianso, M.C., Bull. Soc. Chim. Fr., 1974, 2833. [all data]