Spiro[2.5]octane

Phase change data

Data compiled by: Thermodynamics Research Center, NIST Boulder Laboratories, Chris Muzny director

Quantity Value Units Method Reference Comment
Tboil398.9KN/ABridson-Jones, Buckley, et al., 1951Uncertainty assigned by TRC = 2. K
Tboil398.7KN/AShortridge, Craig, et al., 1948Uncertainty assigned by TRC = 1.5 K
Quantity Value Units Method Reference Comment
Tfus187.0KN/AShortridge, Craig, et al., 1948Uncertainty assigned by TRC = 1. K

In addition to the Thermodynamics Research Center (TRC) data available from this site, much more physical and chemical property data is available from the following TRC products:

Gas phase ion energetics data

Data compiled by: Sharon G. Lias, Rhoda D. Levin, and Sherif A. Kafafi

Ionization energy determinations

IE (eV) Method Reference Comment
9.46PEdeMeijere, 1974Vertical value

References

Bridson-Jones, Buckley, et al., 1951
Bridson-Jones, F.S.; Buckley, G.D.; Cross, L.H.; Driver, A.P., Oxidation of organic compounds by nitrous oxide: I, J. Chem. Soc., 1951, 1951, 2999. [all data]

Shortridge, Craig, et al., 1948
Shortridge, R.W.; Craig, R.A.; Greenlee, K.W.; Derfer, J.M.; Boord, C.E., The Synthesis of Some Cyclopropane and Spirane Hydrocarbons, J. Am. Chem. Soc., 1948, 70, 946. [all data]

deMeijere, 1974
deMeijere, A., Dispiro[2.0.2.4]deca-7,9-dien und Vergleichsverbindungen: Darstellung, UV-, NMR- und Photoelektronen-spektroskopische Untersuchungen, Chem. Ber., 1974, 107, 1684. [all data]