1,7-Dinitroxanthone

Phase change data

Data compiled by: William E. Acree, Jr., James S. Chickos

Enthalpy of fusion

ΔfusH (kcal/mol) Temperature (K) Method Reference
8.898536.4DSCIbrom and Frahm, 1997

References

Ibrom and Frahm, 1997
Ibrom, W.G.; Frahm, A.W., Synthesis and antimycobacterial activity of nitroxanthones. 1st communication: synthesis and differential scanning calorimetry analysis, Arzeim. Forsch. Drug Res., 1997, 47, 5, 662. [all data]