Silane, tetraethynyl-

Gas phase ion energetics data

Data compiled by: Sharon G. Lias, Rhoda D. Levin, and Sherif A. Kafafi

Ionization energy determinations

IE (eV) Method Reference
11.34EIMacLean and Sacher, 1974

References

MacLean and Sacher, 1974
MacLean, D.I.; Sacher, R.E., A study of some spectroscopic properties of Group IVA acetylides, J. Organomet. Chem., 1974, 74, 197. [all data]