Tungsten, pentacarbonyl(phosphorus trifluoride-

Gas phase ion energetics data

Data compiled by: Sharon G. Lias, Rhoda D. Levin, and Sherif A. Kafafi

Ionization energy determinations

IE (eV) Method Reference Comment
8.9PEYarbrough and Hall, 1978
8.68PEDaamen, Boxhoorn, et al., 1978Vertical value

References

Yarbrough and Hall, 1978
Yarbrough, L.W., II; Hall, M.B., Photoelectron spectra of substituted chromium, molybdenum, and tungsten pentacarbonyls. Relative π-acceptor and σ-donor properties of various phosphorus ligands, Inorg. Chem., 1978, 17, 2269. [all data]

Daamen, Boxhoorn, et al., 1978
Daamen, H.; Boxhoorn, G.; Oskam, A., U. V. photoelectron (He I and He II) studies of M(CO)5PX3 (M=Cr, Mo, W and X=F, Cl, Br), Inorg. Chim. Acta, 1978, 28, 263. [all data]