Chromium, pentacarbonyl(phosphorus trifluoride)-

Phase change data

Data compiled by: José A. Martinho Simões

Quantity Value Units Method Reference Comment
Δsub85.5 ± 2.9kJ/molN/ABoxhoorn, Jesse, et al., 1978

Gas phase ion energetics data

Data compiled by: Sharon G. Lias, Rhoda D. Levin, and Sherif A. Kafafi

Ionization energy determinations

IE (eV) Method Reference Comment
8.7PEYarbrough and Hall, 1978
8.70EIMuller, Fenderl, et al., 1971
8.56PEDaamen, Boxhoorn, et al., 1978Vertical value

References

Boxhoorn, Jesse, et al., 1978
Boxhoorn, G.; Jesse, A.C.; Ernsting, J.M.; Oskam, A., Thermochim. Acta, 1978, 27, 261. [all data]

Yarbrough and Hall, 1978
Yarbrough, L.W., II; Hall, M.B., Photoelectron spectra of substituted chromium, molybdenum, and tungsten pentacarbonyls. Relative π-acceptor and σ-donor properties of various phosphorus ligands, Inorg. Chem., 1978, 17, 2269. [all data]

Muller, Fenderl, et al., 1971
Muller, J.; Fenderl, K.; Mertschenk, B., Die Donor-Akzeptor-Eigenschaften des Liganden Trifluorphosphin in Ubergangsmetallkomplexen, Chem. Ber., 1971, 104, 700. [all data]

Daamen, Boxhoorn, et al., 1978
Daamen, H.; Boxhoorn, G.; Oskam, A., U. V. photoelectron (He I and He II) studies of M(CO)5PX3 (M=Cr, Mo, W and X=F, Cl, Br), Inorg. Chim. Acta, 1978, 28, 263. [all data]