3,6-Dihydrochamazulene

Van Den Dool and Kratz RI, non-polar column, custom temperature program

View large format table.

Column type Active phase I Reference Comment
CapillaryHP-5MS1518.7Andriamaharavo, 201430. m/0.25 mm/0.25 μm, He; Program: 60C (1 min) => 5 C/min => 210C => 10 C/min => 280C (15 min)

Normal alkane RI, polar column, temperature ramp

View large format table.

Column type Active phase I Reference Comment
CapillaryNB-20M2350.Orav, Raal, et al., 200630. m/0.2 mm/0.25 μm, He, 2. K/min; Tstart: 50. C; Tend: 250. C

References

Andriamaharavo, 2014
Andriamaharavo, N.R., Retention Data. NIST Mass Spectrometry Data Center., NIST Mass Spectrometry Data Center, 2014. [all data]

Orav, Raal, et al., 2006
Orav, A.; Raal, A.; Arak, E.; Müürisepp, M.; Kailas, T., Composition of the essential oil of Artemisia absinthium L. of different geographical origin, Proc. Est. Acad. Sci. Chem., 2006, 55, 3, 155-165. [all data]