Pyrazine, 2,5-dimethyl-3-(3-methylbutyl)-

Normal alkane RI, polar column, custom temperature program

Data compiled by: NIST Mass Spectrometry Data Center, William E. Wallace, director

Column type Capillary
Active phase TC-Wax
Column length (m)
Carrier gas
Substrate
Column diameter (mm)
Phase thickness (μm)
Program not specified
I 1666.
ReferenceTachihara, Ishizaki, et al., 2004
Comment MSDC-RI

Normal alkane RI, non-polar column, custom temperature program

Data compiled by: NIST Mass Spectrometry Data Center, William E. Wallace, director

Column type CapillaryCapillaryCapillary
Active phase DB-5CP Sil 5 CBCP Sil 5 CB
Column length (m) 30.50.50.
Carrier gas
Substrate
Column diameter (mm) 0.250.320.32
Phase thickness (μm) 0.251.21.2
Program 40 0C (5 min) 5 0C/min -> 260 0C 15 0C/min -> 280 0C (1 min)36C => 20C/min => 85C => 1C/min => 145C=3C/min => 250C(30min)36C => 20C/min => 85C => 1C/min => 145C=3C/min => 250C(30min)
I 1308.1296.1289.
ReferenceYu and Zhang, 2010Counet, Callemien, et al., 2002Counet, Callemien, et al., 2002
Comment MSDC-RI MSDC-RI MSDC-RI

Normal alkane RI, polar column, temperature ramp

Data compiled by: NIST Mass Spectrometry Data Center, William E. Wallace, director

Column type Capillary
Active phase TC-Wax
Column length (m) 60.
Carrier gas N2
Substrate
Column diameter (mm) 0.25
Phase thickness (μm) 0.25
Tstart (C) 70.
Tend (C) 220.
Heat rate (K/min) 3.
Initial hold (min)
Final hold (min) 40.
I 1666.
ReferenceIshizaki, Tachihara, et al., 2005
Comment MSDC-RI

References

Tachihara, Ishizaki, et al., 2004
Tachihara, T.; Ishizaki, S.; Ishikawa, M.; Kitahara, T., Studies on the volatile compounds of roasted spotted shrimp, Chemistry Biodiversity, 2004, 1, 12, 2024-2033, https://doi.org/10.1002/cbdv.200490155 . [all data]