Spiro[5.5]undec-2-ene, 3,7,7-trimethyl-11-methylene-, (-)-

Van Den Dool and Kratz RI, non-polar column, custom temperature program

Data compiled by: NIST Mass Spectrometry Data Center, William E. Wallace, director

Column type CapillaryCapillaryCapillaryCapillary
Active phase HP-5MSBPX-5BPX-5DB-1
Column length (m) 30.30.30.30.
Carrier gas HeHe He
Substrate
Column diameter (mm) 0.250.250.250.25
Phase thickness (μm) 0.250.250.250.25
Program 60C (1 min) => 5 C/min => 210C => 10 C/min => 280C (15 min)35C => 4C/min => 200C => 30C/min => 300C (3min)35C(5min) => 3C/min => 210C => 40C/min => 240C (4min)35C => 2C/min => 200C => 5C/min => 240C
I 1486.1489.1488.1458.
ReferenceAndriamaharavo, 2014Dharmawan, Kasapis, et al., 2007Cardeal, da Silva, et al., 2006Suliman F.E.O., Fatope M.O., et al., 2006
Comment MSDC-RI MSDC-RI MSDC-RI MSDC-RI

References

Andriamaharavo, 2014
Andriamaharavo, N.R., Retention Data. NIST Mass Spectrometry Data Center., NIST Mass Spectrometry Data Center, 2014. [all data]

Dharmawan, Kasapis, et al., 2007
Dharmawan, J.; Kasapis, S.; Curran, P.; Johnson, J.R., Characterization of volatile compounds in selected citrus fruits from Asia. Part I: freshly-squeezed juice, Flavour Fragr. J., 2007, 22, 3, 228-232, https://doi.org/10.1002/ffj.1790 . [all data]

Cardeal, da Silva, et al., 2006
Cardeal, Z.L.; da Silva, M.D.R.G.; Marriott, P.J., Comprehensive two-dimensional gas chromatography/mass spectrometric analysis of pepper volatiles, Rapid Commun. Mass Spectrom., 2006, 20, 19, 2823-2836, https://doi.org/10.1002/rcm.2665 . [all data]

Suliman F.E.O., Fatope M.O., et al., 2006
Suliman F.E.O.; Fatope M.O.; Al-Saidi S.H.; Al-Kindy S.M.Z.; Marwah R.G., Composition and antimicrobial activity of the essential oil of Pluchea arabica from Oman, Flavour Fragr. J., 2006, 21, 3, 469-471, https://doi.org/10.1002/ffj.1616 . [all data]