Benzo[b]thiophene, 2-ethyl-5,7-dimethyl-

Normal alkane RI, non-polar column, temperature ramp

View large format table.

Column type Active phase I Reference Comment
CapillaryDB-Petro1719.Lu, Wu, et al., 200450. m/0.20 mm/0.50 μm, He, 35. C @ 5. min, 2. K/min, 300. C @ 5. min

References

Lu, Wu, et al., 2004
Lu, X.; Wu, J.; Wu, J.; Kong, H.; Hua, R.; Tao, W.; Gu, J.; Xu, G., Characterization and quantitative determination of diesel fractions by comprehensive two-dimensional gas chromatography/time of flight mass spectrometry, Chin. J. Chromatogr., 2004, 22, 1, 5-11. [all data]