Methane, fluorotrinitro-

Condensed phase thermochemistry data

Data compiled by: Hussein Y. Afeefy, Joel F. Liebman, and Stephen E. Stein

Quantity Value Units Method Reference Comment
Δfliquid-220.2 ± 2.0kJ/molCcrZimmer, Robb, et al., 1966Corrected for CODATA value of ΔfH; hcomb of the compound with Ethyl oxalate
Quantity Value Units Method Reference Comment
Δcliquid-3336.6 ± 2.0kJ/molCcrZimmer, Robb, et al., 1966Corrected for CODATA value of ΔfH; hcomb of the compound with Ethyl oxalate

References

Zimmer, Robb, et al., 1966
Zimmer, M.F.; Robb, R.A.; Baroody, E.E.; Carpenter, G.A., Heat of formation and other properties of trinitrofluoromethane, J. Chem. Eng. Data, 1966, 11, 577-579. [all data]