3-Octen-2-one, (E)-

Van Den Dool and Kratz RI, polar column, temperature ramp

View large format table.

Column type Active phase I Reference Comment
CapillaryDB-Wax1411.Shiratsuchi, Shimoda, et al., 199460. m/0.25 mm/0.25 μm, He, 2. K/min, 230. C @ 60. min; Tstart: 50. C

Normal alkane RI, non-polar column, temperature ramp

View large format table.

Column type Active phase I Reference Comment
CapillaryVF-5 MS1032.Liu, Lu, et al., 201130. m/0.25 mm/0.25 μm, Helium, 40. C @ 3. min, 5. K/min, 250. C @ 3. min
CapillaryHP-5 MS1031.Radulovic, Blagojevic, et al., 201030. m/0.25 mm/0.25 μm, Helium, 5. K/min, 290. C @ 10. min; Tstart: 70. C
CapillaryDB-51034.Dhanda, Pegg, et al., 200360. m/0.25 mm/0.25 μm, He, 35. C @ 2. min, 5. K/min, 280. C @ 4. min

Normal alkane RI, non-polar column, custom temperature program

View large format table.

Column type Active phase I Reference Comment
CapillaryVF-5 MS1040.Liu, Lu, et al., 201130. m/0.25 mm/0.25 μm, Helium; Program: not specified
CapillaryHP-51036.Splivallo, Bossi, et al., 2007He; Program: 50C => 3C/min => 200C(10min) => 10C/min => 290C(10min)

Normal alkane RI, polar column, temperature ramp

View large format table.

Column type Active phase I Reference Comment
CapillaryDB-Wax1396.Kobayashi, Tsuda, et al., 1995He, 60. C @ 4. min, 2. K/min; Column length: 60. m; Column diameter: 0.25 mm; Tend: 180. C
CapillaryCarbowax 20M1392.Kawakami, Kobayashi, et al., 1993He, 60. C @ 4. min, 2. K/min; Column length: 50. m; Column diameter: 0.25 mm; Tend: 180. C

References

Shiratsuchi, Shimoda, et al., 1994
Shiratsuchi, H.; Shimoda, M.; Imayoshi, K.; Noda, K.; Osajima, Y., Volatile flavor compounds in spray-dried skim milk powder, J. Agric. Food Chem., 1994, 42, 4, 984-988, https://doi.org/10.1021/jf00040a028 . [all data]

Liu, Lu, et al., 2011
Liu, S.; Lu, S.; Su, Y.; Guo, Y., Analysis of volatile compounds in Radix Bupleuri injection by GC-MS-MS, Chromatographia, 2011, 74, 5-6, 497-502, https://doi.org/10.1007/s10337-011-2082-7 . [all data]

Radulovic, Blagojevic, et al., 2010
Radulovic, N.; Blagojevic, P.; Palic, R., Comparative study of the leaf volatiles of Arctostaphylos uva-ursi (L.) Spreng. and Vaccinium vitis-idaea L. (Ericaceae), Molecules, 2010, 15, 9, 6168-6185, https://doi.org/10.3390/molecules15096168 . [all data]

Dhanda, Pegg, et al., 2003
Dhanda, J.S.; Pegg, R.B.; Shand, P.J., Saskatchewan specialty livestock value-added program - Saskatchewan agri-food innovation fund (AFIF) Project #98000016, 2003, retrieved from http://www.agr.gov.sk.ca/afif/Projects/19980016.pdf. [all data]

Splivallo, Bossi, et al., 2007
Splivallo, R.; Bossi, S.; Maffei, M.; Bonfante, P., Discrimination of truffle fruiting body versus mycelial aromas by stir bar sorptive extraction, Phytochemistry, 2007, 68, 20, 2584-2598, https://doi.org/10.1016/j.phytochem.2007.03.030 . [all data]

Kobayashi, Tsuda, et al., 1995
Kobayashi, A.; Tsuda, Y.; Hirata, N.; Kubota, K.; Kitamura, K., Aroma constituents of soybean [Glycine max (L.) Merril] milk lacking lipoxygenase isozymes, J. Agric. Food Chem., 1995, 43, 9, 2449-2452, https://doi.org/10.1021/jf00057a025 . [all data]

Kawakami, Kobayashi, et al., 1993
Kawakami, M.; Kobayashi, A.; Kator, K., Volatile constituents of Rooibos tea (Aspalathus linearis) as affected by extraction process, J. Agric. Food Chem., 1993, 41, 4, 633-636, https://doi.org/10.1021/jf00028a023 . [all data]