1-Decanol, TMS derivative

Kovats' RI, non-polar column, isothermal

View large format table.

Column type Active phase Temperature (C) I Reference Comment
PackedSE-30100.1372.Zarazir, Chovin, et al., 1970Chromosorb W; Column length: 2. m
PackedSE-30140.1360.Zarazir, Chovin, et al., 1970Chromosorb W; Column length: 2. m

Kovats' RI, polar column, isothermal

View large format table.

Column type Active phase Temperature (C) I Reference Comment
PackedCarbowax 20M100.1395.Zarazir, Chovin, et al., 1970Chromosorb W; Column length: 2. m
PackedCarbowax 20M140.1365.Zarazir, Chovin, et al., 1970Chromosorb W; Column length: 2. m

Van Den Dool and Kratz RI, non-polar column, temperature ramp

View large format table.

Column type Active phase I Reference Comment
CapillaryDB-51393.4Richter, Komarek, et al., 199720. m/0.25 mm/0.25 μm, He, 5.5 K/min; Tstart: 50. C; Tend: 350. C
CapillaryDB-11379.Peng, 199215. m/0.53 mm/1. μm, 40. C @ 4. min, 8. K/min; Tend: 250. C

Van Den Dool and Kratz RI, non-polar column, custom temperature program

View large format table.

Column type Active phase I Reference Comment
CapillaryVF-5MS1367.3Tret'yakov, 200730. m/0.25 mm/0.25 μm, He; Program: Multi-step temperature program; T(initial)=60C; T(final)=270C
CapillaryMethyl Silicone1379.Peng, Yang, et al., 1991Program: not specified

Van Den Dool and Kratz RI, polar column, temperature ramp

View large format table.

Column type Active phase I Reference Comment
CapillaryCarbowax 20M1385.Peng, 19928. K/min, 200. C @ 60. min; Column length: 3.05 m; Tstart: 40. C
PackedCarbowax 20M1385.Peng, Yang, et al., 1991Supelcoport, 40. C @ 4. min, 8. K/min; Column length: 3.05 m; Tend: 200. C

References

Zarazir, Chovin, et al., 1970
Zarazir, D.; Chovin, P.; Guiochon, G., Identification of hydroxylic compounds and their derivatives by gas chromatography, Chromatographia, 1970, 3, 4, 180-195, https://doi.org/10.1007/BF02269018 . [all data]

Richter, Komarek, et al., 1997
Richter, P.; Komarek, K.; Reznicková, I., Identification of alkylpolyethylene glycols in the residues after biodegradation of their mixtures by CGC and previous derivatization, Folia Microbiol. (Prague), 1997, 42, 5, 517-520, https://doi.org/10.1007/BF02826565 . [all data]

Peng, 1992
Peng, C.T., A method for tentative identificatoin of unknown gas chromatographic peaks by retention index, J. Radioanal. Nucl. Chem., 1992, 160, 2, 449-460, https://doi.org/10.1007/BF02037120 . [all data]

Tret'yakov, 2007
Tret'yakov, K.V., Retention Data. NIST Mass Spectrometry Data Center., NIST Mass Spectrometry Data Center, 2007. [all data]

Peng, Yang, et al., 1991
Peng, C.T.; Yang, Z.C.; Maltby, D., Prediction of retention indexes. III. Silylated derivatives of polar compounds, J. Chromatogr., 1991, 586, 1, 113-129, https://doi.org/10.1016/0021-9673(91)80029-G . [all data]