1,4-Cyclohexanedione bis(ethylene ketal)

Phase change data

Data compiled as indicated in comments:
BS - Robert L. Brown and Stephen E. Stein
TRC - Thermodynamics Research Center, NIST Boulder Laboratories, Chris Muzny director
AC - William E. Acree, Jr., James S. Chickos

Quantity Value Units Method Reference Comment
Tfus350.KN/AAlvik, Borgen, et al., 1972Uncertainty assigned by TRC = 1. K; TRC

Reduced pressure boiling point

Tboil (K) Pressure (bar) Reference Comment
353.20.0007Aldrich Chemical Company Inc., 1990BS

Enthalpy of fusion

ΔfusH (kJ/mol) Temperature (K) Reference Comment
25.77353.2Alvik, Borgen, et al., 1972, 2AC

In addition to the Thermodynamics Research Center (TRC) data available from this site, much more physical and chemical property data is available from the following TRC products:

References

Alvik, Borgen, et al., 1972
Alvik, T.; Borgen, G.; Dale, J., Conformational Studies of Normal, Medium, and Large Ring Diametric Cycloalkanediones and Their Ethylene Ketal Derivatives., Acta Chem. Scand., 1972, 26, 1805, https://doi.org/10.3891/acta.chem.scand.26-1805 . [all data]

Aldrich Chemical Company Inc., 1990
Aldrich Chemical Company Inc., Catalog Handbook of Fine Chemicals, Aldrich Chemical Company, Inc., Milwaukee WI, 1990, 1. [all data]

Alvik, Borgen, et al., 1972, 2
Alvik, Thor; Borgen, Gerd; Dale, Johannes; Øye, H.A.; Svensson, Sigfrid, Conformational Studies of Normal, Medium, and Large Ring Diametric Cycloalkanediones and Their Ethylene Ketal Derivatives., Acta Chem. Scand., 1972, 26, 1805-1816, https://doi.org/10.3891/acta.chem.scand.26-1805 . [all data]