Formic acid, 2-propenyl ester

Kovats' RI, non-polar column, isothermal

View large format table.

Column type Active phase Temperature (C) I Reference Comment
PackedApiezon L120.550.Bogoslovsky, Anvaer, et al., 1978Celite 545
PackedApiezon L160.558.Bogoslovsky, Anvaer, et al., 1978Celite 545
PackedSE-30150.571.Allen and Haken, 1970Celite 560 silanized; Column length: 3.7 m

Normal alkane RI, non-polar column, custom temperature program

View large format table.

Column type Active phase I Reference Comment
CapillarySE-30586.Vinogradov, 2004Program: not specified

Normal alkane RI, polar column, custom temperature program

View large format table.

Column type Active phase I Reference Comment
CapillaryCarbowax 20M957.Vinogradov, 2004Program: not specified

References

Bogoslovsky, Anvaer, et al., 1978
Bogoslovsky, Yu.N.; Anvaer, B.I.; Vigdergauz, M.S., Chromatographic constants in gas chromatography (in Russian), Standards Publ. House, Moscow, 1978, 192. [all data]

Allen and Haken, 1970
Allen, I.D.; Haken, J.K., Gas chromatography of homologous esters. Part IV. Influence of stationary phase polarity on retention of unsaturated esters, J. Chromatogr., 1970, 51, 415-422, https://doi.org/10.1016/S0021-9673(01)96890-6 . [all data]

Vinogradov, 2004
Vinogradov, B.A., Production, composition, properties and application of essential oils, 2004, retrieved from http://viness.narod.ru. [all data]