7,8,15,16-Tetrathiadispiro[5.2.5.2]hexadecane

Gas phase ion energetics data

Data compiled by: Sharon G. Lias, Rhoda D. Levin, and Sherif A. Kafafi

Ionization energy determinations

IE (eV) Method Reference Comment
7.98 ± 0.02PEGuimon, Guimon, et al., 1976Vertical value

References

Guimon, Guimon, et al., 1976
Guimon, M.F.; Guimon, C.; Metras, F.; Pfister-Guillouzo, G., Application of photoelectron spectroscopy to conformational analysis of S-tetrathianes, J. Am. Chem. Soc., 1976, 98, 2078. [all data]