(dimethylamino)borane

Gas phase ion energetics data

Data compiled by: Sharon G. Lias, Rhoda D. Levin, and Sherif A. Kafafi

Ionization energy determinations

IE (eV) Method Reference
9.51PEBock and Fuss, 1971

References

Bock and Fuss, 1971
Bock, H.; Fuss, W., Ionisierungsenergien und geometrie von aminoboranen, Chem. Ber., 1971, 104, 1687. [all data]