Gd@C76 radical

Gas phase ion energetics data

Data compiled by: John E. Bartmess

Electron affinity determinations

EA (eV) Method Reference Comment
3.20 ± 0.10IMREBoltalina, Ioffe, et al., 1997Relative to C74-.

References

Boltalina, Ioffe, et al., 1997
Boltalina, O.V.; Ioffe, I.N.; Sorokin, I.D.; Sidorov, L.N., Electron Affinity of Some Endohedral Lanthanide Fullerenes, J. Phys. Chem. A, 1997, 101, 50, 9561, https://doi.org/10.1021/jp972643f . [all data]