iso-Longifolol acetate

Normal alkane RI, non-polar column, temperature ramp

View large format table.

Column type Active phase I Reference Comment
CapillaryDB-51822.Morteza-Semnani, Akbarzadeh, et al., 200630. m/0.25 mm/0.25 μm, He, 4. K/min; Tstart: 60. C; Tend: 220. C
CapillaryDB-51813.Salehi, Sefidkon, et al., 200530. m/0.25 mm/0.25 μm, He, 60. C @ 4. min, 3. K/min; Tend: 220. C

References

Morteza-Semnani, Akbarzadeh, et al., 2006
Morteza-Semnani, K.; Akbarzadeh, M.; Changizi, S., Essential oils composition of Stachys byzantina, S. inflata, S. lavandulifolia and S. laxa from Iran, Flavour Fragr. J., 2006, 21, 2, 300-303, https://doi.org/10.1002/ffj.1594 . [all data]

Salehi, Sefidkon, et al., 2005
Salehi, P.; Sefidkon, F.; Bazzaz Tolami, L.; Sonboli, A., Essential oil composition of Salvia palaestina Benth. from Iran, Flavour Fragr. J., 2005, 20, 5, 525-527, https://doi.org/10.1002/ffj.1448 . [all data]