3,5-Heptanedione, 2,6-dimethyl-

Gas phase thermochemistry data

Data compiled by: Hussein Y. Afeefy, Joel F. Liebman, and Stephen E. Stein

Quantity Value Units Method Reference Comment
Δfgas-470.4 ± 2.1kJ/molCcbFerrao and Ribeiro Da Silva, 1981For enol form(95.8%)

Condensed phase thermochemistry data

Data compiled by: Hussein Y. Afeefy, Joel F. Liebman, and Stephen E. Stein

Quantity Value Units Method Reference Comment
Δfliquid-526.8 ± 2.0kJ/molCcbFerrao and Ribeiro Da Silva, 1981
Δfliquid-527.3 ± 2.1kJ/molCcbFerrao and Ribeiro Da Silva, 1981For enol form(95.8%)
Quantity Value Units Method Reference Comment
Δcliquid-5301.4 ± 1.6kJ/molCcbFerrao and Ribeiro Da Silva, 1981Corresponding Δfliquid = -526.8 kJ/mol (simple calculation by NIST; no Washburn corrections)

Phase change data

Data compiled by: William E. Acree, Jr., James S. Chickos

Quantity Value Units Method Reference Comment
Δvap56.1kJ/molN/ARibeiro da Silva and Irving, 1978

Reaction thermochemistry data

Data compiled by: Hussein Y. Afeefy, Joel F. Liebman, and Stephen E. Stein

Individual Reactions

3,5-Heptanedione, 2,6-dimethyl- = 4-Hepten-3-one, 5-hydroxy-2,6-dimethyl-

By formula: C9H16O2 = C9H16O2

Quantity Value Units Method Reference Comment
Δr-15. ± 0.8kJ/molEqkCalmon, 1969liquid phase; NMR

References

Ferrao and Ribeiro Da Silva, 1981
Ferrao, M.L.C.C.H.; Ribeiro Da Silva, M.A.V., Enthalpies of combustion of four methyl-substituted heptane-3,5-diones and benzoylacetone, J. Chem. Thermodyn., 1981, 13, 567-571. [all data]

Ribeiro da Silva and Irving, 1978
Ribeiro da Silva, M.A.V.; Irving, R.G., Rev. Port. Quim., 1978, 20, 36. [all data]

Calmon, 1969
Calmon, J.P., Thermodynamic functions of enolization of aliphatic β-diketones, C. R. Acad. Sci. Paris, 1969, 268, 1435-1438. [all data]