Phosphonic acid, (propadienyl), dimethyl ester

Gas phase ion energetics data

Data compiled by: Sharon G. Lias and Joel F. Liebman

Ionization energy determinations

IE (eV) Method Reference Comment
9.82PEZverev, Islamov, et al., 1991Vertical value

References

Zverev, Islamov, et al., 1991
Zverev, V.V.; Islamov, R.G.; Khusainova, N.G., Photoelectron spectra and electronic structure of organophosphorus compounds. XI. Phosphorylated allenes and ethylenes, J. Gen. Chem. USSR, 1991, 61, 2174. [all data]