1-Propiovanillone

Van Den Dool and Kratz RI, polar column, temperature ramp

Data compiled by: NIST Mass Spectrometry Data Center, William E. Wallace, director

Column type CapillaryCapillary
Active phase ZB-WaxCP-Wax 58CB
Column length (m) 30.30.
Carrier gas HeHe
Substrate
Column diameter (mm) 0.320.25
Phase thickness (μm) 0.250.22
Tstart (C) 40.40.
Tend (C) 250.220.
Heat rate (K/min) 5.3.
Initial hold (min) 2.
Final hold (min) 5.
I 2693.2677.
ReferenceWu, Zorn, et al., 2007Pabst, Barron, et al., 1991
Comment MSDC-RI MSDC-RI

Van Den Dool and Kratz RI, polar column, custom temperature program

Data compiled by: NIST Mass Spectrometry Data Center, William E. Wallace, director

Column type Capillary
Active phase Stabilwax
Column length (m) 30.
Carrier gas He
Substrate
Column diameter (mm) 0.25
Phase thickness (μm) 0.25
Program 40C => 3C/min => 100C => 5C/min => 240C(10min)
I 2719.
ReferenceNatali N., Chinnici F., et al., 2006
Comment MSDC-RI

References

Wu, Zorn, et al., 2007
Wu, S.; Zorn, H.; Krings, U.; Berger, R.G., Volatiles from submerged and surface-cultured beefsteak fungus, Fistulina hepatica, Flavour Fragr. J., 2007, 22, 1, 53-60, https://doi.org/10.1002/ffj.1758 . [all data]

Pabst, Barron, et al., 1991
Pabst, A.; Barron, D.; Etiévant, P.; Schreier, P., Studies on the enzymatic hydrolysis of bound aroma constituents from raspberry fruit pulp, J. Agric. Food Chem., 1991, 39, 1, 173-175, https://doi.org/10.1021/jf00001a034 . [all data]