Heptadecane, 2,6,10,14-tetramethyl-

Kovats' RI, non-polar column, custom temperature program

Data compiled by: NIST Mass Spectrometry Data Center, William E. Wallace, director

Column type CapillaryCapillaryCapillaryCapillaryCapillary
Active phase Apiezon LApiezon LApiezon LApiezon LApiezon L
Column length (m)
Carrier gas
Substrate
Column diameter (mm)
Phase thickness (μm)
Program not specifiednot specifiednot specifiednot specifiednot specified
I 1867.1870.1870.1872.1872.
ReferenceShlyakhov, 1984Shlyakhov, 1984Shlyakhov, 1984Shlyakhov, 1984Shlyakhov, 1984
Comment MSDC-RI MSDC-RI MSDC-RI MSDC-RI MSDC-RI
Column type Capillary
Active phase Apiezon L
Column length (m)
Carrier gas
Substrate
Column diameter (mm)
Phase thickness (μm)
Program not specified
I 1872.
ReferenceShlyakhov, 1984
Comment MSDC-RI

References

Shlyakhov, 1984
Shlyakhov, A.F., Gas chromatography in organic geochemistry, Nedra, Moscow, 1984, 221. [all data]