Benzene, (1-ethylhexyl)-

Kovats' RI, non-polar column, isothermal

View large format table.

Column type Active phase Temperature (C) I Reference Comment
PackedSqualane95.41322.Soják, Janák, et al., 1977

Normal alkane RI, non-polar column, temperature ramp

View large format table.

Column type Active phase I Reference Comment
CapillaryDB-11352.Zenkevich, Ukolov, et al., 201130. m/0.32 mm/0.25 μm, Nitrogen, 5. K/min; Tstart: 100. C; Tend: 200. C
CapillaryDB-11355.Zenkevich, Ukolov, et al., 201130. m/0.32 mm/0.25 μm, Nitrogen, 5. K/min; Tstart: 100. C; Tend: 200. C
CapillaryDB-11358.Zenkevich, Ukolov, et al., 201130. m/0.32 mm/0.25 μm, Nitrogen, 5. K/min; Tstart: 100. C; Tend: 200. C
CapillaryDB-11366.Zenkevich, Ukolov, et al., 201130. m/0.32 mm/0.25 μm, Nitrogen, 5. K/min; Tstart: 100. C; Tend: 200. C

References

Soják, Janák, et al., 1977
Soják, L.; Janák, J.; Rijks, J.A., Capillary gas chromatography of alkylbenzenes. II. Correlations between the structures and methylene group increments and differences in retention indices of isomers, J. Chromatogr., 1977, 135, 1, 71-84, https://doi.org/10.1016/S0021-9673(00)86303-7 . [all data]

Zenkevich, Ukolov, et al., 2011
Zenkevich, I.G.; Ukolov, A.I.; Kushakova, A.S.; Gustyleva, L.K., Identification of isomeric alkylarenes with the use of additive relations for the evaluation of gas-chromatographic retention indices, Rus. J. Anal. Chem., 2011, 66, 12, 1165-1172, https://doi.org/10.1134/S1061934811120136 . [all data]