Oxalic acid, 2TMS derivative

Normal alkane RI, non-polar column, temperature ramp

Data compiled by: NIST Mass Spectrometry Data Center, William E. Wallace, director

Column type CapillaryCapillaryCapillaryCapillaryPacked
Active phase HP-5 MSHP-5HP-5MSHP-5SE-30
Column length (m) 30.30.30.25.
Carrier gas  HeHeHe
Substrate
Column diameter (mm) 0.250.250.250.32
Phase thickness (μm) 0.250.250.250.52
Tstart (C) 80.50.70.70.70.
Tend (C) 320.300.280.280.150.
Heat rate (K/min) 5. 4.5.5.
Initial hold (min)   3.10.
Final hold (min)   3.
I 1122.1139.1150.1133.1114.
ReferenceErxleben, Gessler, et al., 2012Isidorov, Kotowska, et al., 2005Lee, Yanamandra, et al., 2002Richards, Wong, et al., 1992Butts and Rainey, 1971
Comment MSDC-RI MSDC-RI MSDC-RI MSDC-RI MSDC-RI

Kovats' RI, non-polar column, isothermal

Data compiled by: NIST Mass Spectrometry Data Center, William E. Wallace, director

Column type Packed
Active phase OV-1
Column length (m) 2.
Carrier gas N2
Substrate Chromosorb G (100-120 mesh)
Column diameter (mm)
Phase thickness (μm)
Temperature (C) 160.
I 1100.
ReferencePetersson, 1977
Comment MSDC-RI

References

Erxleben, Gessler, et al., 2012
Erxleben, A.; Gessler, A.; Vervliet-Scheebaum, M.; Reski, R., Metabolite profiling of the moss Physcomitrella patens reveals evolutionary conservation of osmoprotective substances, Plant Cell Rep., 2012, 31, 2, 427-436, https://doi.org/10.1007/s00299-011-1177-9 . [all data]

Isidorov, Kotowska, et al., 2005
Isidorov, V.A.; Kotowska, U.; Vinogorova, V.T., GC Identification of organic compounds based on partition coefficients of their TMS derivatives in a hexane-acetonitrile system and retention indices, Anal. Sci., 2005, 21, 12, 1483-1489, https://doi.org/10.2116/analsci.21.1483 . [all data]

Lee, Yanamandra, et al., 2002
Lee, B.Y.; Yanamandra, K.; Thurmon, T.F., Quantitative estimation of organic analytes with a capillary column, Am. Clin. Lab., 2002, May, 30-34. [all data]

Richards, Wong, et al., 1992
Richards, M.; Wong, Y.S.; Tan, W.C.; Tan, I.K.; Ng, T.L., Profiling urinary organic acids for the diagnosis of inborn errors of metabolism by GC/MS, Bull. Sing. N.I. Chem., 1992, 20, 135-143. [all data]

Butts and Rainey, 1971
Butts, W.C.; Rainey, W.T., Jr., Gas Chromatography and Mass Spectrometry of the Trimethylsilyl Derivatives of Inorganic Anions, Anal. Chem., 1971, 43, 4, 538-542, https://doi.org/10.1021/ac60299a004 . [all data]