5-Octadecanone

Phase change data

Data compiled by: Thermodynamics Research Center, NIST Boulder Laboratories, Chris Muzny director

Quantity Value Units Method Reference Comment
Tfus318.KN/AWhitmore, Sutherland, et al., 1942Uncertainty assigned by TRC = 3. K

In addition to the Thermodynamics Research Center (TRC) data available from this site, much more physical and chemical property data is available from the following TRC products:

References

Whitmore, Sutherland, et al., 1942
Whitmore, F.C.; Sutherland, L.H.; Cosby, J.N., Higher Hydrocarbons. I. Seven Alkyl Substituted Docosanes., J. Am. Chem. Soc., 1942, 64, 1360. [all data]