1,1,1-Trinitro-4,4-bis(difluoroamino)pentane

Condensed phase thermochemistry data

Data compiled by: Hussein Y. Afeefy, Joel F. Liebman, and Stephen E. Stein

Quantity Value Units Method Reference Comment
Δfsolid-254.6kJ/molCcrBaroody and Carpenter, 1972Not corrected for CODATA value of ΔfH
Δfsolid-265.5 ± 3.2kJ/molCcrBaroody, Carpenter, et al., 1968Reanalyzed by Pedley, Naylor, et al., 1986, Original value = -254.8 ± 1.5 kJ/mol
Quantity Value Units Method Reference Comment
Δcsolid-3419.0 ± 1.5kJ/molCcrBaroody, Carpenter, et al., 1968

References

Baroody and Carpenter, 1972
Baroody, E.E.; Carpenter, G.A., Heats of formation of propellant compounds (U), Rpt. Naval Ordnance Systems Command Task No. 331-003/067-1/UR2402-001 for Naval Ordance Station, Indian Head, MD, 1972, 1-9. [all data]

Baroody, Carpenter, et al., 1968
Baroody, E.E.; Carpenter, G.A.; Robb, R.A.; Zimmer, M.F., Heats of formation of 1,1,1-trinitro-4,4-bisdifluoroaminopentane and 2-fluoro-2,2-dinitroethanol by combustion calorimetry, J. Chem. Eng. Data, 1968, 13, 215-217. [all data]

Pedley, Naylor, et al., 1986
Pedley, J.B.; Naylor, R.D.; Kirby, S.P., Thermochemical Data of Organic Compounds, Chapman and Hall, New York, 1986, 1-792. [all data]