Ethyl 3-hydroxy-3-methylbutanoate

Van Den Dool and Kratz RI, non-polar column, custom temperature program

Data compiled by: NIST Mass Spectrometry Data Center, William E. Wallace, director

Column type CapillaryCapillary
Active phase DB-5MSDB-5MS
Column length (m) 30.30.
Carrier gas H2H2
Substrate
Column diameter (mm) 0.250.25
Phase thickness (μm) 0.250.25
Program 40C (5min) => 2C/min => 200C => 5C/min => 250C (15min)40C (5min) => 2C/min => 200C => 5C/min => 250C (15min)
I 926.920.
ReferenceBoulanger and Crouzet, 2001Boulanger and Crouzet, 2001
Comment MSDC-RI MSDC-RI

Normal alkane RI, polar column, custom temperature program

Data compiled by: NIST Mass Spectrometry Data Center, William E. Wallace, director

Column type Capillary
Active phase DB-Wax
Column length (m) 30.
Carrier gas Hydrogen
Substrate
Column diameter (mm) 0.25
Phase thickness (μm) 0.25
Program 35 0C (9 min) 5 0C/min -> 80 0C 1 0C/min -> 100 0C 16 0C/min -> 210 0C (20 min)
I 1407.
ReferenceSampaio, Garruti, et al., 2011
Comment MSDC-RI

References

Boulanger and Crouzet, 2001
Boulanger, R.; Crouzet, J., Identification of the aroma components of acerola (Malphigia glabra L.): free and bound flavor compounds, Food Chem., 2001, 74, 2, 209-216, https://doi.org/10.1016/S0308-8146(01)00128-5 . [all data]