bromovinylmagnesium

Reaction thermochemistry data

Data compiled by: José A. Martinho Simões

Individual Reactions

Hydrogen bromide (g) + C2H3BrMg (solution) = Ethylene (solution) + Br2Mg (solution)

By formula: HBr (g) + C2H3BrMg (solution) = C2H4 (solution) + Br2Mg (solution)

Quantity Value Units Method Reference Comment
Δr-70.29 ± 0.53kcal/molRSCHolm, 1981solvent: Tetrahydrofuran

References

Holm, 1981
Holm, T., J. Chem. Soc., Perkin Trans. II, 1981, 464.. [all data]