Thiazole, 2-methyl-4-phenyl-
- Formula: C10H9NS
- Molecular weight: 175.250
- IUPAC Standard InChIKey: XROORURTAQOYLW-UHFFFAOYSA-N
- CAS Registry Number: 1826-16-0
- Chemical structure:

Van Den Dool and Kratz RI, polar column, temperature ramp

Column type | Active phase | I | Reference | Comment |
---|---|---|---|---|
Capillary | Supelcowax-10 | 2279. | Chung, 1999 | 60. m/0.25 mm/0.25 μm, He, 35. C @ 5. min, 2. K/min, 195. C @ 90. min |

References

Chung, 1999
Chung, H.Y.,
Volatile components in crabmeats of Charybdis feriatus,
J. Agric. Food Chem., 1999, 47, 6, 2280-2287, https://doi.org/10.1021/jf981027t
. [all data]